Description: Post install tests for s ->
Commit: duong-addons:16dc7daf  
Subject: [IMP] d_employee_portal tests: check the timesheet employee pre-conditions
Author: Claude
Commit: odoo:99edb6dd  
Subject: [IMP] account_edi_ubl_cii: Support section in UBL.
Author: Jugurtha
Build time: 76m
Wait time: 3h
Load time: 1h16m
Date (UTC) Level Message
2026-10-03 06:12:43 INFO Init build environment with config duong-addons-run-test
2026-10-03 06:12:43 Starting step restore from config duong-addons-run-test
2026-10-03 06:12:43 Restoring dump 01345-19-0-all.zip from build 1345
2026-10-03 06:12:43 Using Dockerfile Tag odoo:Docker19
2026-10-03 06:14:29 INFO Step restore finished in 105s
2026-10-03 06:14:29 Starting step test_post_install from config duong-addons-run-test
2026-10-03 06:14:29 Using Dockerfile Tag odoo:Docker19
2026-10-03 06:14:37 INFO 1 modules loaded in 0.86s, 0 queries (+0 extra)
2026-10-03 06:14:51 INFO 301 modules loaded in 14.39s, 0 queries (+0 extra)
2026-10-03 06:14:54 INFO Pregenerating assets bundles
2026-10-03 07:09:49 INFO [HOOT] Passed 199 tests (976 assertions, total time: 00:00:07)
2026-10-03 07:09:55 INFO QUnit: passed 72 tests (213 assertions), took 1s
2026-10-03 07:11:40 ERROR ERROR: TestWebAssets.test_assets_url_validation Traceback (most recent call last): File "/usr/lib/python3/dist-packages/urllib3/connectionpool.py", line 537, in _make_request response = conn.getresponse() ^^^^^^^^^^^^^^^^^^ File "/usr/lib/python3/dist-packages/urllib3/connection.py", line 461, in getresponse httplib_response = super().getresponse() ^^^^^^^^^^^^^^^^^^^^^ File "/usr/lib/python3.12/http/client.py", line 1448, in getresponse response.begin() File "/usr/lib/python3.12/http/client.py", line 336, in begin version, status, reason = self._read_status() ^^^^^^^^^^^^^^^^^^^ File "/usr/lib/python3.12/http/client.py", line 297, in _read_status line = str(self.fp.readline(_MAXLINE + 1), "iso-8859-1") ^^^^^^^^^^^^^^^^^^^^^^^^^^^^^^ File "/usr/lib/python3.12/socket.py", line 707, in readinto return self._sock.recv_into(b) ^^^^^^^^^^^^^^^^^^^^^^^ TimeoutError: timed out The above exception was the direct cause of the following exception: Traceback (most recent call last): File "/usr/lib/python3/dist-packages/requests/adapters.py", line 486, in send resp = conn.urlopen( ^^^^^^^^^^^^^ File "/usr/lib/python3/dist-packages/urllib3/connectionpool.py", line 845, in urlopen retries = retries.increment( ^^^^^^^^^^^^^^^^^^ File "/usr/lib/python3/dist-packages/urllib3/util/retry.py", line 472, in increment raise reraise(type(error), error, _stacktrace) ^^^^^^^^^^^^^^^^^^^^^^^^^^^^^^^^^^^^^^^^ File "/usr/lib/python3/dist-packages/urllib3/util/util.py", line 39, in reraise raise value File "/usr/lib/python3/dist-packages/urllib3/connectionpool.py", line 791, in urlopen response = self._make_request( ^^^^^^^^^^^^^^^^^^^ File "/usr/lib/python3/dist-packages/urllib3/connectionpool.py", line 539, in _make_request self._raise_timeout(err=e, url=url, timeout_value=read_timeout) File "/usr/lib/python3/dist-packages/urllib3/connectionpool.py", line 371, in _raise_timeout raise ReadTimeoutError( urllib3.exceptions.ReadTimeoutError: HTTPConnectionPool(host='127.0.0.1', port=8069): Read timed out. (read timeout=12) During handling of the above exception, another exception occurred: Traceback (most recent call last): File "/data/build/odoo/addons/website/tests/test_assets.py", line 192, in test_assets_url_validation self.url_open('/web/assets/debug/web.assets_frontend.js', allow_redirects=False).status_code, ^^^^^^^^^^^^^^^^^^^^^^^^^^^^^^^^^^^^^^^^^^^^^^^^^^^^^^^^^^^^^^^^^^^^^^^^^^^^^^^^ File "/data/build/odoo/odoo/tests/common.py", line 2342, in url_open return self.opener.request(method, url, params=params, data=data, json=json, files=files, timeout=timeout, headers=headers, cookies=cookies, allow_redirects=allow_redirects) ^^^^^^^^^^^^^^^^^^^^^^^^^^^^^^^^^^^^^^^^^^^^^^^^^^^^^^^^^^^^^^^^^^^^^^^^^^^^^^^^^^^^^^^^^^^^^^^^^^^^^^^^^^^^^^^^^^^^^^^^^^^^^^^^^^^^^^^^^^^^^^^^^^^^^^^^^^^^^^^^^^^^^^ File "/data/build/odoo/odoo/tests/common.py", line 2187, in request return super().request(*args, **kwargs) ^^^^^^^^^^^^^^^^^^^^^^^^^^^^^^^^ File "/usr/lib/python3/dist-packages/requests/sessions.py", line 589, in request resp = self.send(prep, **send_kwargs) ^^^^^^^^^^^^^^^^^^^^^^^^^^^^^^ File "/data/build/odoo/odoo/tests/common.py", line 378, in <lambda> lambda s, r, **kwargs: cls._request_handler(s, r, **kwargs), ^^^^^^^^^^^^^^^^^^^^^^^^^^^^^^^^^^^^ File "/data/build/odoo/odoo/tests/common.py", line 346, in _request_handler return _super_send(s, r, **kw) ^^^^^^^^^^^^^^^^^^^^^^^ File "/usr/lib/python3/dist-packages/requests/sessions.py", line 703, in send r = adapter.send(request, **kwargs) ^^^^^^^^^^^^^^^^^^^^^^^^^^^^^^^ File "/usr/lib/python3/dist-packages/requests/adapters.py", line 532, in send raise ReadTimeout(e, request=request) requests.exceptions.ReadTimeout: HTTPConnectionPool(host='127.0.0.1', port=8069): Read timed out. (read timeout=12)
2026-10-03 07:12:34 INFO public crawled 15 urls in 6.33s 397 queries, 0.422s 26.47q per request,
2026-10-03 07:13:09 INFO demo crawled 98 urls in 34.63s 3315 queries, 0.353s 33.83q per request
2026-10-03 07:21:54 ERROR FAIL: TestFuzzy.test_variant_default_code Traceback (most recent call last): File "/data/build/odoo/addons/website_sale/tests/test_fuzzy.py", line 75, in test_variant_default_code self.assertEqual(1, results_count, "Should have found red") AssertionError: 1 != 0 : Should have found red
2026-10-03 07:28:26 ERROR 1 failed, 1 error(s) of 1266 tests when loading database '01356-19-0-all'
2026-10-03 07:28:53 INFO Getting results for build 01356-19-0
2026-10-03 07:28:53 Step test_post_install finished in 74m