Description: Test pylint
Commit: duong-addons:77580023  
Subject: [FIX] d_social_tiktok_messaging: send a TikTok message from a record
Author: daiduongnguyen-odoo
Commit: odoo:99edb6dd  
Subject: [IMP] account_edi_ubl_cii: Support section in UBL.
Author: Jugurtha
Build time: 8m
Wait time: 9m
Load time: 8m23s
Date (UTC) Level Message
2026-10-04 14:39:09 INFO Init build environment with config duong-addons-run-test
2026-10-04 14:39:09 Starting step test_pylint from config duong-addons-run-test
2026-10-04 14:39:09 Using Dockerfile Tag odoo:Docker19
2026-10-04 14:39:46 INFO 1 modules loaded in 19.80s, 8456 queries (+8456 extra)
2026-10-04 14:40:10 ERROR The prop “fieldString="'Subcontractors'"” in file “/data/build/duong-addons/d_mrp_bom_builder_subcontracting/static/src/bom_builder_subcontracting/bom_builder_subcontracting.xml” in the component node starting at line 25 contains what looks like human-readable text. If the content of this prop is intended for display to the end user, add the .translate suffix to make the prop translatable. If this is a false positive, please contact the i18n team.
2026-10-04 14:40:19 ERROR FAIL: TestI18n.test_user_content_as_prop_is_translatable Traceback (most recent call last): File "/data/build/odoo/odoo/addons/test_lint/tests/test_i18n.py", line 128, in test_user_content_as_prop_is_translatable self.assertEqual(error_count, 0) AssertionError: 1 != 0
2026-10-04 14:40:32 ERROR FAIL: Subtest ManifestLinter.test_manifests (module='d_mrp_bom_builder') Traceback (most recent call last): File "/data/build/odoo/odoo/addons/test_lint/tests/test_manifests.py", line 31, in test_manifests self._test_manifest_keys(manifest) File "/data/build/odoo/odoo/addons/test_lint/tests/test_manifests.py", line 37, in _test_manifest_keys self.assertEqual(unknown_keys, set(), f"Unknown manifest keys in module {manifest_data.name!r}. Either there are typos or they must be white listed.") AssertionError: Items in the first set but not the second: 'summary_vi_VN' 'name_vi_VN' : Unknown manifest keys in module 'd_mrp_bom_builder'. Either there are typos or they must be white listed.
2026-10-04 14:40:32 ERROR FAIL: Subtest ManifestLinter.test_manifests (module='d_mrp_bom_builder_mrp_workorder') Traceback (most recent call last): File "/data/build/odoo/odoo/addons/test_lint/tests/test_manifests.py", line 31, in test_manifests self._test_manifest_keys(manifest) File "/data/build/odoo/odoo/addons/test_lint/tests/test_manifests.py", line 37, in _test_manifest_keys self.assertEqual(unknown_keys, set(), f"Unknown manifest keys in module {manifest_data.name!r}. Either there are typos or they must be white listed.") AssertionError: Items in the first set but not the second: 'summary_vi_VN' 'name_vi_VN' : Unknown manifest keys in module 'd_mrp_bom_builder_mrp_workorder'. Either there are typos or they must be white listed.
2026-10-04 14:40:32 ERROR FAIL: Subtest ManifestLinter.test_manifests (module='d_mrp_bom_builder_subcontracting') Traceback (most recent call last): File "/data/build/odoo/odoo/addons/test_lint/tests/test_manifests.py", line 31, in test_manifests self._test_manifest_keys(manifest) File "/data/build/odoo/odoo/addons/test_lint/tests/test_manifests.py", line 37, in _test_manifest_keys self.assertEqual(unknown_keys, set(), f"Unknown manifest keys in module {manifest_data.name!r}. Either there are typos or they must be white listed.") AssertionError: Items in the first set but not the second: 'summary_vi_VN' 'name_vi_VN' : Unknown manifest keys in module 'd_mrp_bom_builder_subcontracting'. Either there are typos or they must be white listed.
2026-10-04 14:40:32 ERROR FAIL: Subtest ManifestLinter.test_manifests (module='d_sale_rotting') Traceback (most recent call last): File "/data/build/odoo/odoo/addons/test_lint/tests/test_manifests.py", line 31, in test_manifests self._test_manifest_keys(manifest) File "/data/build/odoo/odoo/addons/test_lint/tests/test_manifests.py", line 37, in _test_manifest_keys self.assertEqual(unknown_keys, set(), f"Unknown manifest keys in module {manifest_data.name!r}. Either there are typos or they must be white listed.") AssertionError: Items in the first set but not the second: 'summary_vi_VN' 'name_vi_VN' : Unknown manifest keys in module 'd_sale_rotting'. Either there are typos or they must be white listed.
2026-10-04 14:40:32 ERROR FAIL: Subtest ManifestLinter.test_manifests (module='d_social_messaging') Traceback (most recent call last): File "/data/build/odoo/odoo/addons/test_lint/tests/test_manifests.py", line 32, in test_manifests self._test_manifest_values(manifest) File "/data/build/odoo/odoo/addons/test_lint/tests/test_manifests.py", line 56, in _test_manifest_values self.assertNotEqual( AssertionError: False == False : Setting manifest key auto_install to the default manifest value for module 'd_social_messaging'. You can remove this key from the dict to reduce noise/inconsistencies between manifests specifications and ease understanding of manifest content.
2026-10-04 14:40:32 ERROR FAIL: Subtest ManifestLinter.test_manifests (module='d_social_tiktok_messaging') Traceback (most recent call last): File "/data/build/odoo/odoo/addons/test_lint/tests/test_manifests.py", line 32, in test_manifests self._test_manifest_values(manifest) File "/data/build/odoo/odoo/addons/test_lint/tests/test_manifests.py", line 56, in _test_manifest_values self.assertNotEqual( AssertionError: False == False : Setting manifest key auto_install to the default manifest value for module 'd_social_tiktok_messaging'. You can remove this key from the dict to reduce noise/inconsistencies between manifests specifications and ease understanding of manifest content.
2026-10-04 14:40:32 ERROR FAIL: Subtest ManifestLinter.test_manifests (module='d_tiktok_shop_connector_patch1') Traceback (most recent call last): File "/data/build/odoo/odoo/addons/test_lint/tests/test_manifests.py", line 32, in test_manifests self._test_manifest_values(manifest) File "/data/build/odoo/odoo/addons/test_lint/tests/test_manifests.py", line 56, in _test_manifest_values self.assertNotEqual( AssertionError: False == False : Setting manifest key application to the default manifest value for module 'd_tiktok_shop_connector_patch1'. You can remove this key from the dict to reduce noise/inconsistencies between manifests specifications and ease understanding of manifest content.
2026-10-04 14:40:32 ERROR FAIL: Subtest ManifestLinter.test_manifests (module='d_whatsapp') Traceback (most recent call last): File "/data/build/odoo/odoo/addons/test_lint/tests/test_manifests.py", line 32, in test_manifests self._test_manifest_values(manifest) File "/data/build/odoo/odoo/addons/test_lint/tests/test_manifests.py", line 56, in _test_manifest_values self.assertNotEqual( AssertionError: False == False : Setting manifest key application to the default manifest value for module 'd_whatsapp'. You can remove this key from the dict to reduce noise/inconsistencies between manifests specifications and ease understanding of manifest content.
2026-10-04 14:41:19 INFO pylint version: 3.0.3
2026-10-04 14:47:05 ERROR FAIL: TestPyLint.test_pylint Traceback (most recent call last): File "/data/build/odoo/odoo/addons/test_lint/tests/test_pylint.py", line 109, in test_pylint self.fail(f"pylint test failed:\n\n{r.stdout}\n{r.stderr}".strip()) AssertionError: pylint test failed: <unknown>:736: SyntaxWarning: invalid escape sequence '\-' <unknown>:1219: SyntaxWarning: invalid escape sequence '\;' <unknown>:1219: SyntaxWarning: invalid escape sequence '\,'
2026-10-04 14:47:12 ERROR Module test_lint: 10 failures, 0 errors of 24 tests
2026-10-04 14:47:24 INFO 17 modules loaded in 456.00s, 4878 queries (+4948 extra)
2026-10-04 14:47:25 ERROR At least one test failed when loading the modules.
2026-10-04 14:47:25 ERROR 10 failed, 0 error(s) of 24 tests when loading database '01491-19-0-all'
2026-10-04 14:47:32 INFO Getting results for build 01491-19-0
2026-10-04 14:47:32 Step test_pylint finished in 8m