| Date (UTC) | Level | Message | |
|---|---|---|---|
| 2026-10-10 19:16:59 | INFO | Init build environment with config duong-addons-run-test | |
| 2026-10-10 19:16:59 | Starting step restore from config duong-addons-run-test | ||
| 2026-10-10 19:16:59 | Restoring template 02110-19-0-all.zip from build 2110 | ||
| 2026-10-10 19:16:59 | Using Dockerfile Tag odoo:Docker19 | ||
| 2026-10-10 19:19:05 | INFO | Step restore finished in 124s | |
| 2026-10-10 19:19:05 | Starting step test_post_install from config duong-addons-run-test | ||
| 2026-10-10 19:19:05 | Using Dockerfile Tag odoo:Docker19 | ||
| 2026-10-10 19:19:23 | INFO | 1 modules loaded in 1.62s, 0 queries (+0 extra) | |
| 2026-10-10 19:19:44 | INFO | 308 modules loaded in 20.67s, 0 queries (+0 extra) | |
| 2026-10-10 19:19:47 | INFO | Pregenerating assets bundles | |
| 2026-10-10 20:45:41 | INFO | [HOOT] Passed 199 tests (976 assertions, total time: 00:00:06) | |
| 2026-10-10 20:45:47 | INFO | QUnit: passed 72 tests (213 assertions), took 1s | |
| 2026-10-10 20:48:40 | INFO | Request with path /contactus has been ignored during test as it it does not contain the test_cursor cookie or it is expired. (required "/website/tests/test_attachment.py:TestWebsiteAttachment.test_03_link_to_document__0", got "None") | |
| 2026-10-10 20:50:13 | ERROR | Exception during request handling. Traceback (most recent call last): File "/data/build/odoo/odoo/http.py", line 2852, in __call__ response = request._serve_db() ^^^^^^^^^^^^^^^^^^^ File "/data/build/odoo/odoo/http.py", line 2276, in _serve_db cr = registry.cursor(readonly=True) ^^^^^^^^^^^^^^^^^^^^^^^^^^^^^^ File "/data/build/odoo/odoo/tests/common.py", line 801, in _patched_cursor return test_cursor.TestCursor( ^^^^^^^^^^^^^^^^^^^^^^^ File "/data/build/odoo/odoo/tests/test_cursor.py", line 47, in __init__ raise Exception(f'Unable to acquire lock for test cursor after {lock_timeout}s') Exception: Unable to acquire lock for test cursor after 20s | |
| 2026-10-10 20:50:13 | ERROR | FAILED: [14/20] Tour configurator_page_creation → Step Wait until the configurator is finished (trigger: :iframe [data-view-xmlid='website.homepage']). The key { expectUnloadPage } is defined but page has not been unloaded within 20000 ms. You probably don't need it. | |
| 2026-10-10 20:50:13 | ERROR | Exception during request handling. Traceback (most recent call last): File "/data/build/odoo/odoo/http.py", line 2852, in __call__ response = request._serve_db() ^^^^^^^^^^^^^^^^^^^ File "/data/build/odoo/odoo/http.py", line 2276, in _serve_db cr = registry.cursor(readonly=True) ^^^^^^^^^^^^^^^^^^^^^^^^^^^^^^ File "/data/build/odoo/odoo/tests/common.py", line 801, in _patched_cursor return test_cursor.TestCursor( ^^^^^^^^^^^^^^^^^^^^^^^ File "/data/build/odoo/odoo/tests/test_cursor.py", line 47, in __init__ raise Exception(f'Unable to acquire lock for test cursor after {lock_timeout}s') Exception: Unable to acquire lock for test cursor after 20s | |
| 2026-10-10 20:50:13 | INFO | Error received after termination: { "content": "Choose a shop page style", "trigger": ".o_configurator_screen:contains('online catalog') .button_area", "run": "click" }, { "content": "Choose a product page style", "trigger": ".o_configurator_screen:contains('product page') .button_area", "run": "click" }, { "content": "Loader should be shown", "trigger": ".o_website_loader_container", "expectUnloadPage": true }, ---------- FAILED: [14/20] Tour configurator_page_creation → Step Wait until the configurator is finished (trigger: :iframe [data-view-xmlid='website.homepage']) ---------- { "content": "Wait until the configurator is finished", "trigger": ":iframe [data-view-xmlid='website.homepage']", "timeout": 30000 }, ---------------------------------------------------------------------------------------------------------------------------------------------------------------------------- { "content": "Open create content menu", "trigger": ".o_new_content_container button", "run": "click" }, { "content": "Create a new page", "trigger": "button[aria-label='New Page']", "run": "click" }, { "content": "Click on landing pages category", "trigger": "[data-id='landing']", "run": "click" }, | |
| 2026-10-10 20:50:13 | ERROR | Exception during request handling. Traceback (most recent call last): File "/data/build/odoo/odoo/http.py", line 2852, in __call__ response = request._serve_db() ^^^^^^^^^^^^^^^^^^^ File "/data/build/odoo/odoo/http.py", line 2276, in _serve_db cr = registry.cursor(readonly=True) ^^^^^^^^^^^^^^^^^^^^^^^^^^^^^^ File "/data/build/odoo/odoo/tests/common.py", line 801, in _patched_cursor return test_cursor.TestCursor( ^^^^^^^^^^^^^^^^^^^^^^^ File "/data/build/odoo/odoo/tests/test_cursor.py", line 47, in __init__ raise Exception(f'Unable to acquire lock for test cursor after {lock_timeout}s') Exception: Unable to acquire lock for test cursor after 20s | |
| 2026-10-10 20:50:14 | ERROR | Exception during request handling. Traceback (most recent call last): File "/data/build/odoo/odoo/http.py", line 2852, in __call__ response = request._serve_db() ^^^^^^^^^^^^^^^^^^^ File "/data/build/odoo/odoo/http.py", line 2276, in _serve_db cr = registry.cursor(readonly=True) ^^^^^^^^^^^^^^^^^^^^^^^^^^^^^^ File "/data/build/odoo/odoo/tests/common.py", line 801, in _patched_cursor return test_cursor.TestCursor( ^^^^^^^^^^^^^^^^^^^^^^^ File "/data/build/odoo/odoo/tests/test_cursor.py", line 47, in __init__ raise Exception(f'Unable to acquire lock for test cursor after {lock_timeout}s') Exception: Unable to acquire lock for test cursor after 20s | |
| 2026-10-10 20:50:14 | ERROR | Exception during request handling. Traceback (most recent call last): File "/data/build/odoo/odoo/http.py", line 2852, in __call__ response = request._serve_db() ^^^^^^^^^^^^^^^^^^^ File "/data/build/odoo/odoo/http.py", line 2276, in _serve_db cr = registry.cursor(readonly=True) ^^^^^^^^^^^^^^^^^^^^^^^^^^^^^^ File "/data/build/odoo/odoo/tests/common.py", line 801, in _patched_cursor return test_cursor.TestCursor( ^^^^^^^^^^^^^^^^^^^^^^^ File "/data/build/odoo/odoo/tests/test_cursor.py", line 47, in __init__ raise Exception(f'Unable to acquire lock for test cursor after {lock_timeout}s') Exception: Unable to acquire lock for test cursor after 20s | |
| 2026-10-10 20:50:14 | INFO | Error received after termination: ConnectionLostError: Connection to "/website/track_installing_modules" couldn't be established or was interrupted at XMLHttpRequest.<anonymous> (http://127.0.0.1:8069/web/assets/8/2df28a4/web.assets_web.min.js:3204:71) | |
| 2026-10-10 20:50:14 | INFO | Screenshot | |
| 2026-10-10 20:50:15 | INFO | Chrome Log | |
| 2026-10-10 20:50:15 | ERROR | FAIL: TestConfigurator.test_configurator_page_creation Traceback (most recent call last): File "/data/build/odoo/addons/website/tests/test_configurator.py", line 103, in test_configurator_page_creation self.start_tour('/website/force/%s?path=%%2Fwebsite%%2Fconfigurator' % website.id, 'configurator_page_creation', login='admin') File "/data/build/odoo/odoo/tests/common.py", line 2597, in start_tour self.browser_js(url_path=url_path, code=code, ready=ready, timeout=timeout, success_signal="tour succeeded", **kwargs) File "/data/build/odoo/odoo/tests/common.py", line 2567, in browser_js self.fail('%s\n\n%s' % (message, error)) AssertionError: The test code "odoo.startTour('configurator_page_creation', {"stepDelay": 0, "keepWatchBrowser": false, "debug": false, "startUrl": "/website/force/8?path=%2Fwebsite%2Fconfigurator", "delayToCheckUndeterminisms": 0})" failed FAILED: [14/20] Tour configurator_page_creation → Step Wait until the configurator is finished (trigger: :iframe [data-view-xmlid='website.homepage']). The key { expectUnloadPage } is defined but page has not been unloaded within 20000 ms. You probably don't need it. | |
| 2026-10-10 20:51:52 | INFO | public crawled 15 urls in 4.88s 445 queries, 0.325s 29.67q per request, | |
| 2026-10-10 20:52:19 | INFO | demo crawled 98 urls in 26.74s 3645 queries, 0.273s 37.19q per request | |
| 2026-10-10 21:06:14 | INFO | Request with path /website/social/twitter has been ignored during test as it it does not contain the test_cursor cookie or it is expired. (required "/website/tests/test_snippets.py:TestSnippets.test_05_social_media__0", got "None") | |
| 2026-10-10 21:08:43 | INFO | Request with path / has been ignored during test as it it does not contain the test_cursor cookie or it is expired. (required "/website/tests/test_snippets.py:TestSnippets.test_11_snippet_popup_display_on_click__0", got "None") | |
| 2026-10-10 21:08:48 | INFO | Request with path /contactus has been ignored during test as it it does not contain the test_cursor cookie or it is expired. (required "/website/tests/test_snippets.py:TestSnippets.test_11_snippet_popup_display_on_click__0", got "None") | |
| 2026-10-10 21:09:17 | INFO | Request with path /contactus has been ignored during test as it it does not contain the test_cursor cookie or it is expired. (required "/website/tests/test_snippets.py:TestSnippets.test_12_snippet_images_wall__0", got "None") | |
| 2026-10-10 21:19:35 | ERROR | FAILED: [19/20] Tour test_html_editor_scss → Step check that the scss modification got applied (trigger: :iframe body:has(#wrap:hidden)). Element (:iframe body:has(#wrap:hidden)) has not been found. TIMEOUT step failed to complete within 10000 ms. | |
| 2026-10-10 21:19:35 | INFO | Error received after termination: { "content": "add some scss content in the file", "trigger": "div.ace_line .ace_comment:contains(\"footer {\")", "run": "[function]" }, { "trigger": "div.ace_line:contains(\"#wrap {display: none;}\")" }, { "content": "save the html editor", "trigger": ".o_resource_editor_title button:contains(Save)", "run": "click" }, ---------- FAILED: [19/20] Tour test_html_editor_scss → Step check that the scss modification got applied (trigger: :iframe body:has(#wrap:hidden)) ---------- { "content": "check that the scss modification got applied", "trigger": ":iframe body:has(#wrap:hidden)" }, -------------------------------------------------------------------------------------------------------------------------------------------------------------- { "trigger": "nav img[src]:not([src=''])" }, | |
| 2026-10-10 21:19:38 | INFO | Screenshot | |
| 2026-10-10 21:19:38 | INFO | Chrome Log | |
| 2026-10-10 21:19:38 | ERROR | FAIL: TestUiHtmlEditor.test_html_editor_scss Traceback (most recent call last): File "/data/build/odoo/addons/website/tests/test_ui.py", line 160, in test_html_editor_scss self.start_tour(self.env['website'].get_client_action_url('/contactus'), 'test_html_editor_scss', login='admin') File "/data/build/odoo/odoo/tests/common.py", line 2597, in start_tour self.browser_js(url_path=url_path, code=code, ready=ready, timeout=timeout, success_signal="tour succeeded", **kwargs) File "/data/build/odoo/odoo/tests/common.py", line 2567, in browser_js self.fail('%s\n\n%s' % (message, error)) AssertionError: The test code "odoo.startTour('test_html_editor_scss', {"stepDelay": 0, "keepWatchBrowser": false, "debug": false, "startUrl": "/odoo/action-website.website_preview?path=%2Fcontactus", "delayToCheckUndeterminisms": 0})" failed FAILED: [19/20] Tour test_html_editor_scss → Step check that the scss modification got applied (trigger: :iframe body:has(#wrap:hidden)). Element (:iframe body:has(#wrap:hidden)) has not been found. TIMEOUT step failed to complete within 10000 ms. | |
| 2026-10-10 21:26:57 | INFO | Request with path /contactus has been ignored during test as it it does not contain the test_cursor cookie or it is expired. (required "/website/tests/test_ui.py:TestUi.test_09_website_edit_link_popover__0", got "None") | |
| 2026-10-10 21:26:58 | INFO | Request with path / has been ignored during test as it it does not contain the test_cursor cookie or it is expired. (required "/website/tests/test_ui.py:TestUi.test_09_website_edit_link_popover__0", got "None") | |
| 2026-10-10 21:30:25 | INFO | Request with path / has been ignored during test as it it does not contain the test_cursor cookie or it is expired. (required "/website/tests/test_ui.py:TestUi.test_16_website_edit_megamenu__0", got "None") | |
| 2026-10-10 21:30:51 | INFO | Request with path / has been ignored during test as it it does not contain the test_cursor cookie or it is expired. (required "/website/tests/test_ui.py:TestUi.test_17_website_edit_menus__0", got "None") | |
| 2026-10-10 21:30:55 | INFO | Request with path / has been ignored during test as it it does not contain the test_cursor cookie or it is expired. (required "/website/tests/test_ui.py:TestUi.test_17_website_edit_menus__0", got "None") | |
| 2026-10-10 21:30:58 | INFO | Request with path / has been ignored during test as it it does not contain the test_cursor cookie or it is expired. (required "/website/tests/test_ui.py:TestUi.test_17_website_edit_menus__0", got "None") | |
| 2026-10-10 21:36:25 | INFO | Request with path / has been ignored during test as it it does not contain the test_cursor cookie or it is expired. (required "/website/tests/test_ui.py:TestUi.test_31_website_edit_megamenu_big_icons_subtitles__0", got "None") | |
| 2026-10-10 21:39:28 | INFO | Request with path /zoe-s-di-ner has been ignored during test as it it does not contain the test_cursor cookie or it is expired. (required "/website/tests/test_ui.py:TestUi.test_create_missing_page__0", got "None") | |
| 2026-10-10 21:40:52 | ERROR | FAILED: [5/19] Tour hide_sidebar_header → Step Wait for the builder to mount after iframe reload (trigger: :iframe body.editor_enable). Element has been found. BUT: DOM is blocked by UI. TIMEOUT step failed to complete within 10000 ms. | |
| 2026-10-10 21:40:52 | INFO | Error received after termination: { "content": "Click on the header", "trigger": ":iframe #o_main_nav", "run": "click" }, { "content": "Click on header template", "trigger": ".hb-row[data-label='Template'] button.o-hb-select-toggle", "run": "click" }, { "content": "Change header template to 'Sidebar'", "trigger": ".dropdown-menu .o-hb-select-dropdown-item[title='Sidebar']", "run": "click" }, ---------- FAILED: [5/19] Tour hide_sidebar_header → Step Wait for the builder to mount after iframe reload (trigger: :iframe body.editor_enable) ---------- { "content": "Wait for the builder to mount after iframe reload", "trigger": ":iframe body.editor_enable" }, ------------------------------------------------------------------------------------------------------------------------------------------------------------ { "content": "Check that the header changed to 'Sidebar'", "trigger": ":iframe #wrapwrap>header.o_header_sidebar" }, { "content": "Check that the builder is not disabled", "trigger": ".o-website-builder_sidebar:not(:has(.o_builder_disabled))" }, { "trigger": ".o-website-builder_sidebar" }, | |
| 2026-10-10 21:40:54 | INFO | Screenshot | |
| 2026-10-10 21:40:55 | INFO | Chrome Log | |
| 2026-10-10 21:40:55 | ERROR | FAIL: TestUi.test_hiding_sidebar_header Traceback (most recent call last): File "/data/build/odoo/addons/website/tests/test_ui.py", line 727, in test_hiding_sidebar_header self.start_tour("/", "hide_sidebar_header", login="admin") File "/data/build/odoo/odoo/tests/common.py", line 2597, in start_tour self.browser_js(url_path=url_path, code=code, ready=ready, timeout=timeout, success_signal="tour succeeded", **kwargs) File "/data/build/odoo/odoo/tests/common.py", line 2567, in browser_js self.fail('%s\n\n%s' % (message, error)) AssertionError: The test code "odoo.startTour('hide_sidebar_header', {"stepDelay": 0, "keepWatchBrowser": false, "debug": false, "startUrl": "/", "delayToCheckUndeterminisms": 0})" failed FAILED: [5/19] Tour hide_sidebar_header → Step Wait for the builder to mount after iframe reload (trigger: :iframe body.editor_enable). Element has been found. BUT: DOM is blocked by UI. TIMEOUT step failed to complete within 10000 ms. | |
| 2026-10-10 21:42:05 | ERROR | FAILED: [8/18] Tour mega_footer → Step Check that the footer has been replaced (trigger: :iframe footer:not(:has(.if_this_is_here_this_is_the_old_footer))). Element (:iframe footer:not(:has(.if_this_is_here_this_is_the_old_footer))) has not been found. TIMEOUT step failed to complete within 10000 ms. | |
| 2026-10-10 21:42:05 | INFO | Error received after termination: { "content": "<b>Click</b> on this option to change the of the block.", "trigger": ".o_customize_tab [data-container-title='Footer'] [data-label='Template'] .dropdown-toggle, .o_customize_tab [data-container-title='Footer'] [data-action-id=\"[data-label='Template'] .dropdown-toggle\"]", "run": "click", "tooltipPosition": "bottom" }, { "content": "Check if \"Mega\" option is shown. If not, search for it.", "trigger": ".o_popover .o-dropdown-item", "run": "[function]" }, { "content": "Clicking on the Mega in the Template option", "trigger": ".o_popover div.o-dropdown-item:contains(\"Mega\"), .o_popover span.o-dropdown-item:contains(\"Mega\"), .o_popover div.o-dropdown-item[title=\"Mega\"], .o_popover span.o-dropdown-item[title=\"Mega\"], .o_popover Mega", "run": "click" }, ---------- FAILED: [8/18] Tour mega_footer → Step Check that the footer has been replaced (trigger: :iframe footer:not(:has(.if_this_is_here_this_is_the_old_footer))) ---------- { "content": "Check that the footer has been replaced", "trigger": ":iframe footer:not(:has(.if_this_is_here_this_is_the_old_footer))" }, --------------------------------------------------------------------------------------------------------------------------------------------------------------------------------- { "content": "Select all the text of the copyright and company name text", "trigger": ":iframe .o_footer_copyright span", "run": "[function]" }, { "content": "Click on the bold from toolbar", "trigger": ".o-we-toolbar button[title=\"bold\"], .o-we-toolbar button[name=\"bold\"]", "run": "click" }, { "trigger": ".o-snippets-menu:not(:has(.o_we_ongoing_insertion))" }, | |
| 2026-10-10 21:42:05 | INFO | Screenshot | |
| 2026-10-10 21:42:06 | INFO | Chrome Log | |
| 2026-10-10 21:42:06 | ERROR | FAIL: TestUi.test_mega_footer Traceback (most recent call last): File "/data/build/odoo/addons/website/tests/test_ui.py", line 760, in test_mega_footer self.start_tour('/', 'mega_footer', login='admin') File "/data/build/odoo/odoo/tests/common.py", line 2597, in start_tour self.browser_js(url_path=url_path, code=code, ready=ready, timeout=timeout, success_signal="tour succeeded", **kwargs) File "/data/build/odoo/odoo/tests/common.py", line 2567, in browser_js self.fail('%s\n\n%s' % (message, error)) AssertionError: The test code "odoo.startTour('mega_footer', {"stepDelay": 0, "keepWatchBrowser": false, "debug": false, "startUrl": "/", "delayToCheckUndeterminisms": 0})" failed FAILED: [8/18] Tour mega_footer → Step Check that the footer has been replaced (trigger: :iframe footer:not(:has(.if_this_is_here_this_is_the_old_footer))). Element (:iframe footer:not(:has(.if_this_is_here_this_is_the_old_footer))) has not been found. TIMEOUT step failed to complete within 10000 ms. | |
| 2026-10-10 21:46:20 | INFO | Request with path / has been ignored during test as it it does not contain the test_cursor cookie or it is expired. (required "/website/tests/test_ui.py:TestUi.test_website_edit_megamenu_visibility__0", got "None") | |
| 2026-10-10 21:49:12 | INFO | Request with path / has been ignored during test as it it does not contain the test_cursor cookie or it is expired. (required "/website/tests/test_ui.py:TestUi.test_website_megamenu_active_nav_link__0", got "None") | |
| 2026-10-10 21:49:16 | INFO | Request with path / has been ignored during test as it it does not contain the test_cursor cookie or it is expired. (required "/website/tests/test_ui.py:TestUi.test_website_megamenu_active_nav_link__0", got "None") | |
| 2026-10-10 21:50:00 | INFO | Request with path / has been ignored during test as it it does not contain the test_cursor cookie or it is expired. (required "/website/tests/test_ui.py:TestUi.test_website_no_dirty_page__0", got "None") | |
| 2026-10-10 21:50:17 | INFO | Request with path /odoo has been ignored during test as it it does not contain the test_cursor cookie or it is expired. (required "/website/tests/test_ui.py:TestUi.test_website_optimize_seo_with_multiple_fields__0", got "None") | |
| 2026-10-10 21:50:17 | INFO | Request with path /my/home has been ignored during test as it it does not contain the test_cursor cookie or it is expired. (required "/website/tests/test_ui.py:TestUi.test_website_optimize_seo_with_multiple_fields__0", got "None") | |
| 2026-10-10 21:50:17 | INFO | Request with path /web/session/logout has been ignored during test as it it does not contain the test_cursor cookie or it is expired. (required "/website/tests/test_ui.py:TestUi.test_website_optimize_seo_with_multiple_fields__0", got "None") | |
| 2026-10-10 21:50:17 | INFO | Request with path / has been ignored during test as it it does not contain the test_cursor cookie or it is expired. (required "/website/tests/test_ui.py:TestUi.test_website_optimize_seo_with_multiple_fields__0", got "None") | |
| 2026-10-10 21:50:17 | INFO | Request with path /contactus has been ignored during test as it it does not contain the test_cursor cookie or it is expired. (required "/website/tests/test_ui.py:TestUi.test_website_optimize_seo_with_multiple_fields__0", got "None") | |
| 2026-10-10 21:50:17 | INFO | Request with path /website/social/facebook has been ignored during test as it it does not contain the test_cursor cookie or it is expired. (required "/website/tests/test_ui.py:TestUi.test_website_optimize_seo_with_multiple_fields__0", got "None") | |
| 2026-10-10 21:50:17 | INFO | Request with path /website/social/twitter has been ignored during test as it it does not contain the test_cursor cookie or it is expired. (required "/website/tests/test_ui.py:TestUi.test_website_optimize_seo_with_multiple_fields__0", got "None") | |
| 2026-10-10 21:50:17 | INFO | Request with path /website/social/linkedin has been ignored during test as it it does not contain the test_cursor cookie or it is expired. (required "/website/tests/test_ui.py:TestUi.test_website_optimize_seo_with_multiple_fields__0", got "None") | |
| 2026-10-10 21:50:21 | INFO | Request with path /odoo has been ignored during test as it it does not contain the test_cursor cookie or it is expired. (required "/website/tests/test_ui.py:TestUi.test_website_optimize_seo_with_multiple_fields__0", got "None") | |
| 2026-10-10 21:50:21 | INFO | Request with path /my/home has been ignored during test as it it does not contain the test_cursor cookie or it is expired. (required "/website/tests/test_ui.py:TestUi.test_website_optimize_seo_with_multiple_fields__0", got "None") | |
| 2026-10-10 21:50:21 | INFO | Request with path /web/session/logout has been ignored during test as it it does not contain the test_cursor cookie or it is expired. (required "/website/tests/test_ui.py:TestUi.test_website_optimize_seo_with_multiple_fields__0", got "None") | |
| 2026-10-10 21:50:21 | INFO | Request with path / has been ignored during test as it it does not contain the test_cursor cookie or it is expired. (required "/website/tests/test_ui.py:TestUi.test_website_optimize_seo_with_multiple_fields__0", got "None") | |
| 2026-10-10 21:50:21 | INFO | Request with path /contactus has been ignored during test as it it does not contain the test_cursor cookie or it is expired. (required "/website/tests/test_ui.py:TestUi.test_website_optimize_seo_with_multiple_fields__0", got "None") | |
| 2026-10-10 21:50:21 | INFO | Request with path /website/social/facebook has been ignored during test as it it does not contain the test_cursor cookie or it is expired. (required "/website/tests/test_ui.py:TestUi.test_website_optimize_seo_with_multiple_fields__0", got "None") | |
| 2026-10-10 21:50:21 | INFO | Request with path /website/social/twitter has been ignored during test as it it does not contain the test_cursor cookie or it is expired. (required "/website/tests/test_ui.py:TestUi.test_website_optimize_seo_with_multiple_fields__0", got "None") | |
| 2026-10-10 21:50:21 | INFO | Request with path /website/social/linkedin has been ignored during test as it it does not contain the test_cursor cookie or it is expired. (required "/website/tests/test_ui.py:TestUi.test_website_optimize_seo_with_multiple_fields__0", got "None") | |
| 2026-10-10 21:51:05 | ERROR | FAILED: [7/33] Tour website_seo_notification → Step .o_builder_sidebar_open. Element has been found. BUT: Element is not visible. TIP: You can use :not(:visible) to force the search for an invisible element. TIMEOUT step failed to complete within 10000 ms. | |
| 2026-10-10 21:51:05 | INFO | Error received after termination: { "content": "Insert page name", "trigger": ".modal:not(.o_inactive_modal):contains(new page) .modal-body input[type=text]", "run": "edit Test Page" }, { "trigger": "input[type='text']:value(Test Page)" }, { "content": "Create page", "trigger": ".modal:not(.o_inactive_modal):contains(new page) button.btn-primary:contains(create)", "run": "click" }, ---------- FAILED: [7/33] Tour website_seo_notification → Step .o_builder_sidebar_open ---------- { "trigger": ".o_builder_sidebar_open" }, ------------------------------------------------------------------------------------------------- { "content": "Click on the <b>Content</b> category.", "trigger": ".o_block_tab:not(.o_we_ongoing_insertion) #snippet_groups .o_snippet[name=\"Content\"].o_draggable .o_snippet_thumbnail_area", "run": "click", "tooltipPosition": "bottom" }, { "content": "Click on the <b>Text - Image</b> building block.", "trigger": ".modal .show:iframe .o_snippet_preview_wrap[data-snippet-id=\"s_text_image\"]:not(.d-none)", "run": "click", "tooltipPosition": "top" }, { "trigger": ".o_website_preview :iframe:not(:has(.o_loading_screen))" }, | |
| 2026-10-10 21:51:06 | INFO | Screenshot | |
| 2026-10-10 21:51:06 | INFO | Chrome Log | |
| 2026-10-10 21:51:06 | ERROR | FAIL: TestUi.test_website_seo_notification Traceback (most recent call last): File "/data/build/odoo/addons/website/tests/test_ui.py", line 706, in test_website_seo_notification self.start_tour(self.env['website'].get_client_action_url("/"), "website_seo_notification", login="admin") File "/data/build/odoo/odoo/tests/common.py", line 2597, in start_tour self.browser_js(url_path=url_path, code=code, ready=ready, timeout=timeout, success_signal="tour succeeded", **kwargs) File "/data/build/odoo/odoo/tests/common.py", line 2567, in browser_js self.fail('%s\n\n%s' % (message, error)) AssertionError: The test code "odoo.startTour('website_seo_notification', {"stepDelay": 0, "keepWatchBrowser": false, "debug": false, "startUrl": "/odoo/action-website.website_preview?path=%2F", "delayToCheckUndeterminisms": 0})" failed FAILED: [7/33] Tour website_seo_notification → Step .o_builder_sidebar_open. Element has been found. BUT: Element is not visible. TIP: You can use :not(:visible) to force the search for an invisible element. TIMEOUT step failed to complete within 10000 ms. | |
| 2026-10-10 21:55:55 | INFO | Request with path / has been ignored during test as it it does not contain the test_cursor cookie or it is expired. (required "/website/tests/test_website_form_editor.py:TestWebsiteFormEditor.test_tour__0", got "None") | |
| 2026-10-10 21:56:35 | INFO | Request with path / has been ignored during test as it it does not contain the test_cursor cookie or it is expired. (required "/website/tests/test_website_form_editor.py:TestWebsiteFormEditor.test_tour__0", got "None") | |
| 2026-10-10 22:08:01 | INFO | Request with path /event has been ignored during test as it it does not contain the test_cursor cookie or it is expired. (required "/website_event/tests/test_website_event.py:TestUi.test_website_event_pages_seo__0", got "None") | |
| 2026-10-10 22:08:01 | INFO | Request with path /odoo has been ignored during test as it it does not contain the test_cursor cookie or it is expired. (required "/website_event/tests/test_website_event.py:TestUi.test_website_event_pages_seo__0", got "None") | |
| 2026-10-10 22:08:01 | INFO | Request with path /web/session/logout has been ignored during test as it it does not contain the test_cursor cookie or it is expired. (required "/website_event/tests/test_website_event.py:TestUi.test_website_event_pages_seo__0", got "None") | |
| 2026-10-10 22:08:01 | INFO | Request with path /my/home has been ignored during test as it it does not contain the test_cursor cookie or it is expired. (required "/website_event/tests/test_website_event.py:TestUi.test_website_event_pages_seo__0", got "None") | |
| 2026-10-10 22:08:01 | INFO | Request with path /event/event-with-menu-7/register has been ignored during test as it it does not contain the test_cursor cookie or it is expired. (required "/website_event/tests/test_website_event.py:TestUi.test_website_event_pages_seo__0", got "None") | |
| 2026-10-10 22:08:01 | INFO | Request with path / has been ignored during test as it it does not contain the test_cursor cookie or it is expired. (required "/website_event/tests/test_website_event.py:TestUi.test_website_event_pages_seo__0", got "None") | |
| 2026-10-10 22:08:01 | INFO | Request with path /contactus has been ignored during test as it it does not contain the test_cursor cookie or it is expired. (required "/website_event/tests/test_website_event.py:TestUi.test_website_event_pages_seo__0", got "None") | |
| 2026-10-10 22:08:01 | INFO | Request with path /website/social/facebook has been ignored during test as it it does not contain the test_cursor cookie or it is expired. (required "/website_event/tests/test_website_event.py:TestUi.test_website_event_pages_seo__0", got "None") | |
| 2026-10-10 22:08:01 | INFO | Request with path /website/social/twitter has been ignored during test as it it does not contain the test_cursor cookie or it is expired. (required "/website_event/tests/test_website_event.py:TestUi.test_website_event_pages_seo__0", got "None") | |
| 2026-10-10 22:08:01 | INFO | Request with path /event/event-with-menu-7/register has been ignored during test as it it does not contain the test_cursor cookie or it is expired. (required "/website_event/tests/test_website_event.py:TestUi.test_website_event_pages_seo__0", got "None") | |
| 2026-10-10 22:08:01 | INFO | Request with path /website/social/linkedin has been ignored during test as it it does not contain the test_cursor cookie or it is expired. (required "/website_event/tests/test_website_event.py:TestUi.test_website_event_pages_seo__0", got "None") | |
| 2026-10-10 22:11:40 | ERROR | FAILED: [9/33] Tour website_links_tour → Step Make sure a SelectMenu has been opened (trigger: .o_select_menu_menu). Element (.o_select_menu_menu) has not been found. TIMEOUT step failed to complete within 10000 ms. | |
| 2026-10-10 22:11:40 | INFO | Error received after termination: { "content": "Select found selectMenu item", "trigger": ".o_popover .o_select_menu_item:contains(\"Some new campaign\")", "run": "click" }, { "content": "Check that selectMenu is properly filled", "trigger": "#campaign-select-wrapper .o_select_menu_toggler:value('Some new campaign')" }, { "content": "Click selectMenu form item", "trigger": ".o_website_links_utm_forms div#campaign-select-wrapper .o_select_menu_toggler", "run": "click" }, ---------- FAILED: [9/33] Tour website_links_tour → Step Make sure a SelectMenu has been opened (trigger: .o_select_menu_menu) ---------- { "content": "Make sure a SelectMenu has been opened", "trigger": ".o_select_menu_menu" }, ----------------------------------------------------------------------------------------------------------------------------------------- { "trigger": ".o_website_links_utm_forms div#campaign-select-wrapper .o_select_menu_input", "run": "[function]" }, { "content": "Select found selectMenu item", "trigger": ".o_popover .o_select_menu_item:contains(\"Super Specific Campaign\")", "run": "click" }, { "content": "Check that selectMenu is properly filled", "trigger": "#campaign-select-wrapper .o_select_menu_toggler:value('Super Specific Campaign')" }, | |
| 2026-10-10 22:11:40 | INFO | Screenshot | |
| 2026-10-10 22:11:40 | INFO | Chrome Log | |
| 2026-10-10 22:11:40 | ERROR | FAIL: TestUi.test_01_test_ui Traceback (most recent call last): File "/data/build/odoo/addons/website_links/tests/test_ui.py", line 27, in test_01_test_ui self.start_tour("/", 'website_links_tour', login="admin") File "/data/build/odoo/odoo/tests/common.py", line 2597, in start_tour self.browser_js(url_path=url_path, code=code, ready=ready, timeout=timeout, success_signal="tour succeeded", **kwargs) File "/data/build/odoo/odoo/tests/common.py", line 2567, in browser_js self.fail('%s\n\n%s' % (message, error)) AssertionError: The test code "odoo.startTour('website_links_tour', {"stepDelay": 0, "keepWatchBrowser": false, "debug": false, "startUrl": "/", "delayToCheckUndeterminisms": 0})" failed FAILED: [9/33] Tour website_links_tour → Step Make sure a SelectMenu has been opened (trigger: .o_select_menu_menu). Element (.o_select_menu_menu) has not been found. TIMEOUT step failed to complete within 10000 ms. | |
| 2026-10-10 22:32:26 | ERROR | FAILED: [77/77] Tour add_to_cart_snippet_tour → Step Checking if Pink is the chosen combination in the cart (trigger: :iframe span[class*=h6]:contains(Pink)). Element (:iframe span[class*=h6]:contains(Pink)) has not been found. TIMEOUT step failed to complete within 10000 ms. | |
| 2026-10-10 22:32:26 | INFO | Error received after termination: { "content": "Checking if Product Yes Variant 1 is in the cart", "trigger": ":iframe h6:contains(Product Yes Variant 1)" }, { "content": "Checking if Red is the chosen combination in the cart", "trigger": ":iframe span[class*=h6]:contains(Red)" }, { "content": "Checking if Product Yes Variant 2 is in the cart", "trigger": ":iframe h6:contains(Product Yes Variant 2)" }, ---------- FAILED: [77/77] Tour add_to_cart_snippet_tour → Step Checking if Pink is the chosen combination in the cart (trigger: :iframe span[class*=h6]:contains(Pink)) ---------- { "content": "Checking if Pink is the chosen combination in the cart", "trigger": ":iframe span[class*=h6]:contains(Pink)" }, ----------------------------------------------------------------------------------------------------------------------------------------------------------------------------------- | |
| 2026-10-10 22:32:27 | INFO | Screenshot | |
| 2026-10-10 22:32:27 | INFO | Chrome Log | |
| 2026-10-10 22:32:27 | ERROR | FAIL: TestAddToCartSnippet.test_configure_product Traceback (most recent call last): File "/data/build/odoo/addons/website_sale/tests/test_website_sale_add_to_cart_snippet.py", line 84, in test_configure_product self.start_tour("/", 'add_to_cart_snippet_tour', login="admin") File "/data/build/odoo/odoo/tests/common.py", line 2597, in start_tour self.browser_js(url_path=url_path, code=code, ready=ready, timeout=timeout, success_signal="tour succeeded", **kwargs) File "/data/build/odoo/odoo/tests/common.py", line 2567, in browser_js self.fail('%s\n\n%s' % (message, error)) AssertionError: The test code "odoo.startTour('add_to_cart_snippet_tour', {"stepDelay": 0, "keepWatchBrowser": false, "debug": false, "startUrl": "/", "delayToCheckUndeterminisms": 0})" failed FAILED: [77/77] Tour add_to_cart_snippet_tour → Step Checking if Pink is the chosen combination in the cart (trigger: :iframe span[class*=h6]:contains(Pink)). Element (:iframe span[class*=h6]:contains(Pink)) has not been found. TIMEOUT step failed to complete within 10000 ms. | |
| 2026-10-10 22:52:07 | ERROR | TypeError: Cannot read properties of undefined (reading 'Util') at SlideUploadCategory.onChangeFileInput (http://127.0.0.1:8069/web/assets/1/f5ed584/web.assets_frontend_lazy.min.js:13858:212) | |
| 2026-10-10 22:52:07 | INFO | Screenshot | |
| 2026-10-10 22:52:07 | INFO | Chrome Log | |
| 2026-10-10 22:52:07 | ERROR | FAIL: TestUiPublisher.test_course_publisher_elearning_manager Traceback (most recent call last): File "/data/build/odoo/addons/website_slides/tests/test_ui_wslides.py", line 346, in test_course_publisher_elearning_manager self.start_tour(self.env['website'].get_client_action_url('/slides'), 'course_publisher_standard', login=user_demo.login) File "/data/build/odoo/odoo/tests/common.py", line 2597, in start_tour self.browser_js(url_path=url_path, code=code, ready=ready, timeout=timeout, success_signal="tour succeeded", **kwargs) File "/data/build/odoo/odoo/tests/common.py", line 2567, in browser_js self.fail('%s\n\n%s' % (message, error)) AssertionError: The test code "odoo.startTour('course_publisher_standard', {"stepDelay": 0, "keepWatchBrowser": false, "debug": false, "startUrl": "/odoo/action-website.website_preview?path=%2Fslides", "delayToCheckUndeterminisms": 0})" failed TypeError: Cannot read properties of undefined (reading 'Util') at SlideUploadCategory.onChangeFileInput (http://127.0.0.1:8069/web/assets/1/f5ed584/web.assets_frontend_lazy.min.js:13858:212) | |
| 2026-10-10 22:53:13 | ERROR | 8 failed, 0 error(s) of 1615 tests when loading database '02121-19-0-all' | |
| 2026-10-10 22:53:36 | INFO | Getting results for build 02121-19-0 | |
| 2026-10-10 22:53:36 | Step test_post_install finished in 4h |