| Date (UTC) | Level | Message | |
|---|---|---|---|
| 2026-10-13 13:43:46 | INFO | Init build environment with config duong-addons-run-test | |
| 2026-10-13 13:43:46 | Starting step test_pylint from config duong-addons-run-test | ||
| 2026-10-13 13:43:46 | Using Dockerfile Tag odoo:Docker19 | ||
| 2026-10-13 13:44:28 | INFO | 1 modules loaded in 27.21s, 8456 queries (+8456 extra) | |
| 2026-10-13 13:45:17 | ERROR | FAIL: Subtest ManifestLinter.test_manifests (module='d_social_messaging') Traceback (most recent call last): File "/data/build/odoo/odoo/addons/test_lint/tests/test_manifests.py", line 32, in test_manifests self._test_manifest_values(manifest) File "/data/build/odoo/odoo/addons/test_lint/tests/test_manifests.py", line 56, in _test_manifest_values self.assertNotEqual( AssertionError: False == False : Setting manifest key auto_install to the default manifest value for module 'd_social_messaging'. You can remove this key from the dict to reduce noise/inconsistencies between manifests specifications and ease understanding of manifest content. | |
| 2026-10-13 13:45:17 | ERROR | FAIL: Subtest ManifestLinter.test_manifests (module='d_social_tiktok_messaging') Traceback (most recent call last): File "/data/build/odoo/odoo/addons/test_lint/tests/test_manifests.py", line 32, in test_manifests self._test_manifest_values(manifest) File "/data/build/odoo/odoo/addons/test_lint/tests/test_manifests.py", line 56, in _test_manifest_values self.assertNotEqual( AssertionError: False == False : Setting manifest key auto_install to the default manifest value for module 'd_social_tiktok_messaging'. You can remove this key from the dict to reduce noise/inconsistencies between manifests specifications and ease understanding of manifest content. | |
| 2026-10-13 13:45:17 | ERROR | FAIL: Subtest ManifestLinter.test_manifests (module='d_whatsapp') Traceback (most recent call last): File "/data/build/odoo/odoo/addons/test_lint/tests/test_manifests.py", line 32, in test_manifests self._test_manifest_values(manifest) File "/data/build/odoo/odoo/addons/test_lint/tests/test_manifests.py", line 56, in _test_manifest_values self.assertNotEqual( AssertionError: False == False : Setting manifest key application to the default manifest value for module 'd_whatsapp'. You can remove this key from the dict to reduce noise/inconsistencies between manifests specifications and ease understanding of manifest content. | |
| 2026-10-13 13:46:12 | INFO | pylint version: 3.0.3 | |
| 2026-10-13 14:08:49 | ERROR | FAIL: TestPyLint.test_pylint Traceback (most recent call last): File "/data/build/odoo/odoo/addons/test_lint/tests/test_pylint.py", line 109, in test_pylint self.fail(f"pylint test failed:\n\n{r.stdout}\n{r.stderr}".strip()) AssertionError: pylint test failed: ************* Module d_social_tiktok_messaging.models.tiktok_auto_message Raise inside unlink override. (E8503) at duong-addons/d_social_tiktok_messaging/models/tiktok_auto_message.py:207 Raise inside unlink override. (E8503) at duong-addons/d_social_tiktok_messaging/models/tiktok_auto_message.py:217 ------------------------------------ Your code has been rated at 10.00/10 <unknown>:736: SyntaxWarning: invalid escape sequence '\-' <unknown>:1219: SyntaxWarning: invalid escape sequence '\;' <unknown>:1219: SyntaxWarning: invalid escape sequence '\,' | |
| 2026-10-13 14:08:57 | ERROR | Module test_lint: 4 failures, 0 errors of 24 tests | |
| 2026-10-13 14:09:17 | INFO | 17 modules loaded in 1486.33s, 4878 queries (+4934 extra) | |
| 2026-10-13 14:09:18 | ERROR | At least one test failed when loading the modules. | |
| 2026-10-13 14:09:18 | ERROR | 4 failed, 0 error(s) of 24 tests when loading database '02157-19-0-all' | |
| 2026-10-13 14:09:31 | INFO | Getting results for build 02157-19-0 | |
| 2026-10-13 14:09:31 | Step test_pylint finished in 26m |