| Date (UTC) | Level | Message | |
|---|---|---|---|
| 2026-10-17 17:22:37 | INFO | Init build environment with config duong-addons-run-test | |
| 2026-10-17 17:22:37 | Starting step restore from config duong-addons-run-test | ||
| 2026-10-17 17:22:37 | Restoring template 02290-19-0-all.zip from build 2290 | ||
| 2026-10-17 17:22:37 | Using Dockerfile Tag odoo:Docker19 | ||
| 2026-10-17 17:23:50 | INFO | Step restore finished in 73s | |
| 2026-10-17 17:23:50 | Starting step test_post_install from config duong-addons-run-test | ||
| 2026-10-17 17:23:50 | Using Dockerfile Tag odoo:Docker19 | ||
| 2026-10-17 17:23:57 | INFO | 1 modules loaded in 0.84s, 0 queries (+0 extra) | |
| 2026-10-17 17:24:12 | INFO | 326 modules loaded in 14.22s, 0 queries (+0 extra) | |
| 2026-10-17 17:24:15 | INFO | Pregenerating assets bundles | |
| 2026-10-17 17:27:41 | WARNING | /data/build/duong-addons/d_social_content_tank_meta_ads/models/meta_ad_creative.py:48: DeprecationWarning: Since 19.0, use check_access File "/data/build/odoo/odoo-bin", line 6, in <module> odoo.cli.main() File "/data/build/odoo/odoo/cli/command.py", line 133, in main command().run(args) File "/data/build/odoo/odoo/cli/server.py", line 127, in run main(args) File "/data/build/odoo/odoo/cli/server.py", line 118, in main rc = server.start(preload=config['db_name'], stop=stop) File "/data/build/odoo/odoo/service/server.py", line 1677, in start rc = server.run(preload, stop) File "/data/build/odoo/odoo/service/server.py", line 714, in run rc = preload_registries(preload) File "/data/build/odoo/odoo/service/server.py", line 1607, in preload_registries result = loader.run_suite(post_install_suite, global_report=registry._assertion_report) File "/data/build/odoo/odoo/tests/loader.py", line 116, in run_suite suite(results) File "/usr/lib/python3.12/unittest/suite.py", line 84, in __call__ return self.run(*args, **kwds) File "/data/build/odoo/odoo/tests/suite.py", line 79, in run test(result) File "/usr/lib/python3.12/unittest/case.py", line 690, in __call__ return self.run(*args, **kwds) File "/data/build/odoo/odoo/tests/case.py", line 216, in run self._callTestMethod(testMethod) File "/data/build/odoo/odoo/tests/case.py", line 184, in _callTestMethod method() File "/data/build/duong-addons/d_crm_meta_lead_ads/tests/test_meta_ad_boost.py", line 489, in test_ad_activation_chain_is_parent_first campaign, adset, _creative, ad = self._create_chain() File "/data/build/duong-addons/d_crm_meta_lead_ads/tests/test_meta_ad_boost.py", line 58, in _create_chain creative = self.env['meta.ad.creative'].create({ File "/data/build/odoo/odoo/orm/decorators.py", line 369, in create return method(self, vals_list) File "/data/build/duong-addons/d_social_content_tank_meta_ads/models/meta_ad_creative.py", line 22, in create self._content_tank_check_media_access(vals_list) File "/data/build/duong-addons/d_social_content_tank_meta_ads/models/meta_ad_creative.py", line 48, in _content_tank_check_media_access media.attachment_id.check('read') | |
| 2026-10-17 17:27:44 | WARNING | Meta did not provide optional Instagram copyright information for media video_1: Meta API error: Video content was not found. | Code: 9005 | Subcode: 1452042 | |
| 2026-10-17 17:27:44 | WARNING | Meta did not provide optional Instagram copyright information for media video_1: Meta is temporarily unavailable while checking Instagram boost eligibility. Click Refresh Eligibility or try Boost Post again. Details: Meta API error: Service temporarily unavailable | Code: 2 | Subcode: 1357038 | |
| 2026-10-17 17:27:47 | WARNING | no translation language detected, skipping translation <frame at 0x7dca8ae0b700, file '/data/build/duong-addons/d_crm_meta_lead_ads/wizards/meta_ad_composer.py', line 523, code money> | |
| 2026-10-17 17:27:47 | WARNING | no translation language detected, skipping translation <frame at 0x7dca8ae0a080, file '/data/build/duong-addons/d_crm_meta_lead_ads/wizards/meta_ad_composer.py', line 523, code money> | |
| 2026-10-17 17:27:48 | WARNING | no translation language detected, skipping translation <frame at 0x7dca8ae08880, file '/data/build/duong-addons/d_crm_meta_lead_ads/wizards/meta_ad_composer.py', line 523, code money> | |
| 2026-10-17 17:27:48 | WARNING | no translation language detected, skipping translation <frame at 0x7dca8ae0abc0, file '/data/build/duong-addons/d_crm_meta_lead_ads/wizards/meta_ad_composer.py', line 523, code money> | |
| 2026-10-17 17:27:48 | WARNING | no translation language detected, skipping translation <frame at 0x7dca8ae08dc0, file '/data/build/duong-addons/d_crm_meta_lead_ads/wizards/meta_ad_composer.py', line 523, code money> | |
| 2026-10-17 17:27:48 | WARNING | no translation language detected, skipping translation <frame at 0x7dca8ae0abc0, file '/data/build/duong-addons/d_crm_meta_lead_ads/wizards/meta_ad_composer.py', line 523, code money> | |
| 2026-10-17 17:27:49 | WARNING | no translation language detected, skipping translation <frame at 0x7dca8ae0b700, file '/data/build/duong-addons/d_crm_meta_lead_ads/wizards/meta_ad_composer.py', line 523, code money> | |
| 2026-10-17 17:27:49 | WARNING | no translation language detected, skipping translation <frame at 0x7dca8ae08280, file '/data/build/duong-addons/d_crm_meta_lead_ads/wizards/meta_ad_composer.py', line 523, code money> | |
| 2026-10-17 17:27:49 | WARNING | no translation language detected, skipping translation <frame at 0x7dca8ae08c40, file '/data/build/duong-addons/d_crm_meta_lead_ads/wizards/meta_ad_composer.py', line 523, code money> | |
| 2026-10-17 17:27:49 | WARNING | no translation language detected, skipping translation <frame at 0x7dca8ae08280, file '/data/build/duong-addons/d_crm_meta_lead_ads/wizards/meta_ad_composer.py', line 523, code money> | |
| 2026-10-17 17:27:49 | WARNING | no translation language detected, skipping translation <frame at 0x7dca8ae08c40, file '/data/build/duong-addons/d_crm_meta_lead_ads/wizards/meta_ad_composer.py', line 523, code money> | |
| 2026-10-17 17:27:49 | WARNING | no translation language detected, skipping translation <frame at 0x7dca8ae08dc0, file '/data/build/duong-addons/d_crm_meta_lead_ads/wizards/meta_ad_composer.py', line 523, code money> | |
| 2026-10-17 17:27:49 | WARNING | no translation language detected, skipping translation <frame at 0x7dca8a0aea40, file '/data/build/duong-addons/d_crm_meta_lead_ads/wizards/meta_ad_composer.py', line 523, code money> | |
| 2026-10-17 17:28:01 | WARNING | no translation language detected, skipping translation <frame at 0x7dca8a0a1140, file '/data/build/duong-addons/d_crm_meta_lead_ads/models/meta_ad_constants.py', line 363, code build_adset_bid_payload> | |
| 2026-10-17 17:28:03 | WARNING | no translation language detected, skipping translation <frame at 0x7dca875dd150, file '/data/build/duong-addons/d_crm_meta_lead_ads/wizards/meta_ad_wizard.py', line 485, code _guidance_selection_label> | |
| 2026-10-17 17:28:46 | WARNING | /data/build/duong-addons/d_social_content_tank/models/content_asset.py:235: DeprecationWarning: Since 19.0, use check_access File "/data/build/odoo/odoo-bin", line 6, in <module> odoo.cli.main() File "/data/build/odoo/odoo/cli/command.py", line 133, in main command().run(args) File "/data/build/odoo/odoo/cli/server.py", line 127, in run main(args) File "/data/build/odoo/odoo/cli/server.py", line 118, in main rc = server.start(preload=config['db_name'], stop=stop) File "/data/build/odoo/odoo/service/server.py", line 1677, in start rc = server.run(preload, stop) File "/data/build/odoo/odoo/service/server.py", line 714, in run rc = preload_registries(preload) File "/data/build/odoo/odoo/service/server.py", line 1607, in preload_registries result = loader.run_suite(post_install_suite, global_report=registry._assertion_report) File "/data/build/odoo/odoo/tests/loader.py", line 116, in run_suite suite(results) File "/usr/lib/python3.12/unittest/suite.py", line 84, in __call__ return self.run(*args, **kwds) File "/data/build/odoo/odoo/tests/suite.py", line 79, in run test(result) File "/usr/lib/python3.12/unittest/case.py", line 690, in __call__ return self.run(*args, **kwds) File "/data/build/odoo/odoo/tests/case.py", line 216, in run self._callTestMethod(testMethod) File "/data/build/odoo/odoo/tests/case.py", line 184, in _callTestMethod method() File "/data/build/duong-addons/d_social_content_tank/tests/test_business_hardening.py", line 47, in test_failed_post_copies_return_to_private post = self._create_post(self._create_album(photo_count=1), self.account_a) File "/data/build/duong-addons/d_social_content_tank/tests/common.py", line 51, in _create_album asset._add_media_from_attachments(cls._create_photos(photo_count, offset)) File "/data/build/duong-addons/d_social_content_tank_website/models/content_asset.py", line 62, in _add_media_from_attachments media = super()._add_media_from_attachments(attachments, **media_vals) File "/data/build/duong-addons/d_social_content_tank/models/content_asset.py", line 235, in _add_media_from_attachments attachments.check('read') | |
| 2026-10-17 17:28:46 | WARNING | /data/build/duong-addons/d_social_content_tank/models/content_media.py:185: DeprecationWarning: Since 19.0, use check_access File "/data/build/odoo/odoo-bin", line 6, in <module> odoo.cli.main() File "/data/build/odoo/odoo/cli/command.py", line 133, in main command().run(args) File "/data/build/odoo/odoo/cli/server.py", line 127, in run main(args) File "/data/build/odoo/odoo/cli/server.py", line 118, in main rc = server.start(preload=config['db_name'], stop=stop) File "/data/build/odoo/odoo/service/server.py", line 1677, in start rc = server.run(preload, stop) File "/data/build/odoo/odoo/service/server.py", line 714, in run rc = preload_registries(preload) File "/data/build/odoo/odoo/service/server.py", line 1607, in preload_registries result = loader.run_suite(post_install_suite, global_report=registry._assertion_report) File "/data/build/odoo/odoo/tests/loader.py", line 116, in run_suite suite(results) File "/usr/lib/python3.12/unittest/suite.py", line 84, in __call__ return self.run(*args, **kwds) File "/data/build/odoo/odoo/tests/suite.py", line 79, in run test(result) File "/usr/lib/python3.12/unittest/case.py", line 690, in __call__ return self.run(*args, **kwds) File "/data/build/odoo/odoo/tests/case.py", line 216, in run self._callTestMethod(testMethod) File "/data/build/odoo/odoo/tests/case.py", line 184, in _callTestMethod method() File "/data/build/duong-addons/d_social_content_tank/tests/test_business_hardening.py", line 47, in test_failed_post_copies_return_to_private post = self._create_post(self._create_album(photo_count=1), self.account_a) File "/data/build/duong-addons/d_social_content_tank/tests/common.py", line 51, in _create_album asset._add_media_from_attachments(cls._create_photos(photo_count, offset)) File "/data/build/duong-addons/d_social_content_tank_website/models/content_asset.py", line 62, in _add_media_from_attachments media = super()._add_media_from_attachments(attachments, **media_vals) File "/data/build/duong-addons/d_social_content_tank/models/content_asset.py", line 267, in _add_media_from_attachments return self.env['d.social.content.media'].create(vals_list) File "/data/build/odoo/odoo/orm/decorators.py", line 369, in create return method(self, vals_list) File "/data/build/duong-addons/d_social_content_tank/models/content_media.py", line 217, in create self._check_media_values_access(vals) File "/data/build/duong-addons/d_social_content_tank/models/content_media.py", line 185, in _check_media_values_access self.env['ir.attachment'].browse(vals['attachment_id']).check('read') | |
| 2026-10-17 17:28:46 | WARNING | /data/build/duong-addons/d_social_content_tank/models/ir_attachment.py:47: DeprecationWarning: Since 19.0, use check_access File "/data/build/odoo/odoo-bin", line 6, in <module> odoo.cli.main() File "/data/build/odoo/odoo/cli/command.py", line 133, in main command().run(args) File "/data/build/odoo/odoo/cli/server.py", line 127, in run main(args) File "/data/build/odoo/odoo/cli/server.py", line 118, in main rc = server.start(preload=config['db_name'], stop=stop) File "/data/build/odoo/odoo/service/server.py", line 1677, in start rc = server.run(preload, stop) File "/data/build/odoo/odoo/service/server.py", line 714, in run rc = preload_registries(preload) File "/data/build/odoo/odoo/service/server.py", line 1607, in preload_registries result = loader.run_suite(post_install_suite, global_report=registry._assertion_report) File "/data/build/odoo/odoo/tests/loader.py", line 116, in run_suite suite(results) File "/usr/lib/python3.12/unittest/suite.py", line 84, in __call__ return self.run(*args, **kwds) File "/data/build/odoo/odoo/tests/suite.py", line 79, in run test(result) File "/usr/lib/python3.12/unittest/case.py", line 690, in __call__ return self.run(*args, **kwds) File "/data/build/odoo/odoo/tests/case.py", line 216, in run self._callTestMethod(testMethod) File "/data/build/odoo/odoo/tests/case.py", line 184, in _callTestMethod method() File "/data/build/duong-addons/d_social_content_tank/tests/test_business_hardening.py", line 47, in test_failed_post_copies_return_to_private post = self._create_post(self._create_album(photo_count=1), self.account_a) File "/data/build/duong-addons/d_social_content_tank/tests/common.py", line 61, in _create_post return self.env['d.social.post'].create({ File "/data/build/odoo/odoo/orm/decorators.py", line 369, in create return method(self, vals_list) File "/data/build/duong-addons/d_social_content_tank/models/social_post.py", line 64, in create )._content_tank_sync_attachments() File "/data/build/duong-addons/d_social_content_tank/models/social_post.py", line 121, in _content_tank_sync_attachments new_copies |= media.attachment_id._content_tank_light_copy({ File "/data/build/duong-addons/d_social_content_tank/models/ir_attachment.py", line 47, in _content_tank_light_copy self.check('read') | |
| 2026-10-17 17:28:53 | WARNING | /data/build/duong-addons/d_social_content_tank/models/discuss_channel.py:62: DeprecationWarning: Since 19.0, use check_access File "/data/build/odoo/odoo-bin", line 6, in <module> odoo.cli.main() File "/data/build/odoo/odoo/cli/command.py", line 133, in main command().run(args) File "/data/build/odoo/odoo/cli/server.py", line 127, in run main(args) File "/data/build/odoo/odoo/cli/server.py", line 118, in main rc = server.start(preload=config['db_name'], stop=stop) File "/data/build/odoo/odoo/service/server.py", line 1677, in start rc = server.run(preload, stop) File "/data/build/odoo/odoo/service/server.py", line 714, in run rc = preload_registries(preload) File "/data/build/odoo/odoo/service/server.py", line 1607, in preload_registries result = loader.run_suite(post_install_suite, global_report=registry._assertion_report) File "/data/build/odoo/odoo/tests/loader.py", line 116, in run_suite suite(results) File "/usr/lib/python3.12/unittest/suite.py", line 84, in __call__ return self.run(*args, **kwds) File "/data/build/odoo/odoo/tests/suite.py", line 79, in run test(result) File "/usr/lib/python3.12/unittest/case.py", line 690, in __call__ return self.run(*args, **kwds) File "/data/build/odoo/odoo/tests/case.py", line 216, in run self._callTestMethod(testMethod) File "/data/build/odoo/odoo/tests/case.py", line 184, in _callTestMethod method() File "/data/build/duong-addons/d_social_content_tank/tests/test_messages.py", line 46, in test_files_are_inserted_in_the_message_being_written data = self.channel.content_tank_attach_media(self.album.media_ids.ids) File "/data/build/duong-addons/d_social_content_tank/models/discuss_channel.py", line 62, in content_tank_attach_media media.attachment_id.check('read') | |
| 2026-10-17 17:28:58 | WARNING | /data/build/duong-addons/d_social_content_tank/models/social_post.py:204: DeprecationWarning: Since 19.0, use check_access File "/data/build/odoo/odoo-bin", line 6, in <module> odoo.cli.main() File "/data/build/odoo/odoo/cli/command.py", line 133, in main command().run(args) File "/data/build/odoo/odoo/cli/server.py", line 127, in run main(args) File "/data/build/odoo/odoo/cli/server.py", line 118, in main rc = server.start(preload=config['db_name'], stop=stop) File "/data/build/odoo/odoo/service/server.py", line 1677, in start rc = server.run(preload, stop) File "/data/build/odoo/odoo/service/server.py", line 714, in run rc = preload_registries(preload) File "/data/build/odoo/odoo/service/server.py", line 1607, in preload_registries result = loader.run_suite(post_install_suite, global_report=registry._assertion_report) File "/data/build/odoo/odoo/tests/loader.py", line 116, in run_suite suite(results) File "/usr/lib/python3.12/unittest/suite.py", line 84, in __call__ return self.run(*args, **kwds) File "/data/build/odoo/odoo/tests/suite.py", line 79, in run test(result) File "/usr/lib/python3.12/unittest/case.py", line 690, in __call__ return self.run(*args, **kwds) File "/data/build/odoo/odoo/tests/case.py", line 216, in run self._callTestMethod(testMethod) File "/data/build/odoo/odoo/tests/case.py", line 184, in _callTestMethod method() File "/data/build/duong-addons/d_social_content_tank/tests/test_post_wizard.py", line 29, in test_accounts_receiving_the_same_files_share_one_post post = self._run_wizard(album, self.account_a | self.account_a2 | self.account_b) File "/data/build/duong-addons/d_social_content_tank/tests/test_post_wizard.py", line 17, in _run_wizard wizard_form.social_account_ids.add(account) File "/data/build/odoo/odoo/tests/form.py", line 957, in add parent._perform_onchange(self._field) File "/data/build/odoo/odoo/tests/form.py", line 579, in _perform_onchange result = record.onchange(values, field_names, self._view['fields_spec']) File "/data/build/odoo/addons/web/models/models.py", line 2190, in onchange snapshot1 = RecordSnapshot(record, fields_spec) File "/data/build/odoo/addons/web/models/models.py", line 2276, in __init__ self.fetch(name) File "/data/build/odoo/addons/web/models/models.py", line 2289, in fetch self[field_name] = {line.id: RecordSnapshot(line, sub_fields_spec) for line in lines} File "/data/build/odoo/addons/web/models/models.py", line 2276, in __init__ self.fetch(name) File "/data/build/odoo/addons/web/models/models.py", line 2291, in fetch self[field_name] = self.record[field_name] File "/data/build/odoo/odoo/orm/models.py", line 6701, in __getitem__ return self._fields[key].__get__(self) File "/data/build/odoo/odoo/orm/fields.py", line 1745, in __get__ self.compute_value(recs) File "/data/build/odoo/odoo/orm/fields.py", line 1916, in compute_value records._compute_field_value(self) File "/data/build/odoo/odoo/orm/models.py", line 4961, in _compute_field_value determine(field.compute, self) File "/data/build/odoo/odoo/orm/fields.py", line 81, in determine return needle(*args) File "/data/build/duong-addons/d_social_content_tank/wizard/content_post_wizard.py", line 214, in _compute_limit_warning self.env['d.social.post']._content_tank_validate_attachment_set(selected.attachment_id, { File "/data/build/duong-addons/d_social_content_tank/models/social_post.py", line 204, in _content_tank_validate_attachment_set attachments.check('read') | |
| 2026-10-17 17:29:00 | WARNING | /data/build/duong-addons/d_social_content_tank/models/social_post_live.py:170: DeprecationWarning: Since 19.0, use _commit_progress File "/data/build/odoo/odoo-bin", line 6, in <module> odoo.cli.main() File "/data/build/odoo/odoo/cli/command.py", line 133, in main command().run(args) File "/data/build/odoo/odoo/cli/server.py", line 127, in run main(args) File "/data/build/odoo/odoo/cli/server.py", line 118, in main rc = server.start(preload=config['db_name'], stop=stop) File "/data/build/odoo/odoo/service/server.py", line 1677, in start rc = server.run(preload, stop) File "/data/build/odoo/odoo/service/server.py", line 714, in run rc = preload_registries(preload) File "/data/build/odoo/odoo/service/server.py", line 1607, in preload_registries result = loader.run_suite(post_install_suite, global_report=registry._assertion_report) File "/data/build/odoo/odoo/tests/loader.py", line 116, in run_suite suite(results) File "/usr/lib/python3.12/unittest/suite.py", line 84, in __call__ return self.run(*args, **kwds) File "/data/build/odoo/odoo/tests/suite.py", line 79, in run test(result) File "/usr/lib/python3.12/unittest/case.py", line 690, in __call__ return self.run(*args, **kwds) File "/data/build/odoo/odoo/tests/case.py", line 216, in run self._callTestMethod(testMethod) File "/data/build/odoo/odoo/tests/case.py", line 184, in _callTestMethod method() File "/data/build/duong-addons/d_social_content_tank/tests/test_publication.py", line 214, in test_deleted_on_the_platform self.env['d.social.post.live']._cron_content_tank_check_removed() File "/data/build/duong-addons/d_social_content_tank/models/social_post_live.py", line 170, in _cron_content_tank_check_removed self.env['ir.cron']._notify_progress(done=len(live_posts), remaining=self.search_count(domain)) | |
| 2026-10-17 17:29:21 | WARNING | /data/build/duong-addons/d_social_content_tank_facebook/models/content_fb_import.py:316: DeprecationWarning: Since 19.0, use _commit_progress File "/data/build/odoo/odoo-bin", line 6, in <module> odoo.cli.main() File "/data/build/odoo/odoo/cli/command.py", line 133, in main command().run(args) File "/data/build/odoo/odoo/cli/server.py", line 127, in run main(args) File "/data/build/odoo/odoo/cli/server.py", line 118, in main rc = server.start(preload=config['db_name'], stop=stop) File "/data/build/odoo/odoo/service/server.py", line 1677, in start rc = server.run(preload, stop) File "/data/build/odoo/odoo/service/server.py", line 714, in run rc = preload_registries(preload) File "/data/build/odoo/odoo/service/server.py", line 1607, in preload_registries result = loader.run_suite(post_install_suite, global_report=registry._assertion_report) File "/data/build/odoo/odoo/tests/loader.py", line 116, in run_suite suite(results) File "/usr/lib/python3.12/unittest/suite.py", line 84, in __call__ return self.run(*args, **kwds) File "/data/build/odoo/odoo/tests/suite.py", line 79, in run test(result) File "/usr/lib/python3.12/unittest/case.py", line 690, in __call__ return self.run(*args, **kwds) File "/data/build/odoo/odoo/tests/case.py", line 216, in run self._callTestMethod(testMethod) File "/data/build/odoo/odoo/tests/case.py", line 184, in _callTestMethod method() File "/data/build/duong-addons/d_social_content_tank_facebook/tests/test_import.py", line 221, in test_preview_where_facebook_delivered_no_file_can_be_retried batch._cron_process() File "/data/build/duong-addons/d_social_content_tank_facebook/models/content_fb_import.py", line 316, in _cron_process self.env['ir.cron']._notify_progress(done=done, remaining=Item.search_count(domain)) | |
| 2026-10-17 17:29:29 | ERROR | FAIL: TestInstagramPost.test_instagram_photos_must_be_jpeg Traceback (most recent call last): File "/data/build/duong-addons/d_social_content_tank_instagram/tests/test_instagram_post.py", line 60, in test_instagram_photos_must_be_jpeg with self.assertRaisesRegex(ValidationError, 'not in the correct format'): AssertionError: ValidationError not raised | |
| 2026-10-17 17:29:29 | ERROR | FAIL: TestInstagramPost.test_instagram_still_needs_a_file Traceback (most recent call last): File "/data/build/duong-addons/d_social_content_tank_instagram/tests/test_instagram_post.py", line 64, in test_instagram_still_needs_a_file with self.assertRaises(ValidationError): File "/usr/lib/python3.12/contextlib.py", line 144, in __exit__ next(self.gen) File "/data/build/odoo/odoo/tests/common.py", line 514, in _assertRaises with ExitStack() as inner: File "/usr/lib/python3.12/contextlib.py", line 610, in __exit__ raise exc_details[1] File "/usr/lib/python3.12/contextlib.py", line 595, in __exit__ if cb(*exc_details): ^^^^^^^^^^^^^^^^ AssertionError: ValidationError not raised | |
| 2026-10-17 17:29:30 | WARNING | /data/build/duong-addons/d_social_content_tank_meta_ads/models/content_media.py:17: DeprecationWarning: Since 19.0, use check_access File "/data/build/odoo/odoo-bin", line 6, in <module> odoo.cli.main() File "/data/build/odoo/odoo/cli/command.py", line 133, in main command().run(args) File "/data/build/odoo/odoo/cli/server.py", line 127, in run main(args) File "/data/build/odoo/odoo/cli/server.py", line 118, in main rc = server.start(preload=config['db_name'], stop=stop) File "/data/build/odoo/odoo/service/server.py", line 1677, in start rc = server.run(preload, stop) File "/data/build/odoo/odoo/service/server.py", line 714, in run rc = preload_registries(preload) File "/data/build/odoo/odoo/service/server.py", line 1607, in preload_registries result = loader.run_suite(post_install_suite, global_report=registry._assertion_report) File "/data/build/odoo/odoo/tests/loader.py", line 116, in run_suite suite(results) File "/usr/lib/python3.12/unittest/suite.py", line 84, in __call__ return self.run(*args, **kwds) File "/data/build/odoo/odoo/tests/suite.py", line 79, in run test(result) File "/usr/lib/python3.12/unittest/case.py", line 690, in __call__ return self.run(*args, **kwds) File "/data/build/odoo/odoo/tests/case.py", line 216, in run self._callTestMethod(testMethod) File "/data/build/odoo/odoo/tests/case.py", line 184, in _callTestMethod method() File "/data/build/duong-addons/d_social_content_tank_meta_ads/tests/test_composer.py", line 94, in test_another_image_replaces_the_tank_file wizard.content_tank_set_composer_media(self.photo.id) File "/data/build/duong-addons/d_social_content_tank_meta_ads/models/meta_ad_wizard.py", line 27, in content_tank_set_composer_media vals = media._content_tank_meta_ad_vals(self.ad_account_id) File "/data/build/duong-addons/d_social_content_tank_meta_ads/models/content_media.py", line 17, in _content_tank_meta_ad_vals self.attachment_id.check('read') | |
| 2026-10-17 17:29:30 | WARNING | no translation language detected, skipping translation <frame at 0x7dca8a456e00, file '/data/build/duong-addons/d_crm_meta_lead_ads/wizards/meta_ad_composer.py', line 523, code money> | |
| 2026-10-17 17:29:30 | WARNING | no translation language detected, skipping translation <frame at 0x7dca8a456140, file '/data/build/duong-addons/d_crm_meta_lead_ads/wizards/meta_ad_composer.py', line 523, code money> | |
| 2026-10-17 17:29:31 | WARNING | no translation language detected, skipping translation <frame at 0x7dca8a455000, file '/data/build/duong-addons/d_crm_meta_lead_ads/wizards/meta_ad_composer.py', line 523, code money> | |
| 2026-10-17 17:29:31 | WARNING | no translation language detected, skipping translation <frame at 0x7dca8a456140, file '/data/build/duong-addons/d_crm_meta_lead_ads/wizards/meta_ad_composer.py', line 523, code money> | |
| 2026-10-17 17:29:31 | WARNING | no translation language detected, skipping translation <frame at 0x7dca8a455000, file '/data/build/duong-addons/d_crm_meta_lead_ads/wizards/meta_ad_composer.py', line 523, code money> | |
| 2026-10-17 17:29:31 | WARNING | no translation language detected, skipping translation <frame at 0x7dca8a456e00, file '/data/build/duong-addons/d_crm_meta_lead_ads/wizards/meta_ad_composer.py', line 523, code money> | |
| 2026-10-17 17:29:31 | WARNING | no translation language detected, skipping translation <frame at 0x7dca8a455000, file '/data/build/duong-addons/d_crm_meta_lead_ads/wizards/meta_ad_composer.py', line 523, code money> | |
| 2026-10-17 17:29:31 | WARNING | no translation language detected, skipping translation <frame at 0x7dca8a455000, file '/data/build/duong-addons/d_crm_meta_lead_ads/wizards/meta_ad_composer.py', line 523, code money> | |
| 2026-10-17 17:29:34 | WARNING | no translation language detected, skipping translation <frame at 0x7dca949e7880, file '/data/build/duong-addons/d_crm_meta_lead_ads/wizards/meta_ad_composer.py', line 523, code money> | |
| 2026-10-17 17:29:34 | WARNING | no translation language detected, skipping translation <frame at 0x7dca949e6d40, file '/data/build/duong-addons/d_crm_meta_lead_ads/wizards/meta_ad_composer.py', line 523, code money> | |
| 2026-10-17 17:29:34 | WARNING | no translation language detected, skipping translation <frame at 0x7dca949e6a40, file '/data/build/duong-addons/d_crm_meta_lead_ads/wizards/meta_ad_composer.py', line 523, code money> | |
| 2026-10-17 17:29:34 | WARNING | no translation language detected, skipping translation <frame at 0x7dca949e6a40, file '/data/build/duong-addons/d_crm_meta_lead_ads/wizards/meta_ad_composer.py', line 523, code money> | |
| 2026-10-17 17:29:35 | WARNING | no translation language detected, skipping translation <frame at 0x7dca949e6a40, file '/data/build/duong-addons/d_crm_meta_lead_ads/wizards/meta_ad_composer.py', line 523, code money> | |
| 2026-10-17 17:29:35 | WARNING | no translation language detected, skipping translation <frame at 0x7dca949e7880, file '/data/build/duong-addons/d_crm_meta_lead_ads/wizards/meta_ad_composer.py', line 523, code money> | |
| 2026-10-17 17:29:35 | WARNING | no translation language detected, skipping translation <frame at 0x7dca949e7880, file '/data/build/duong-addons/d_crm_meta_lead_ads/wizards/meta_ad_composer.py', line 523, code money> | |
| 2026-10-17 17:29:35 | WARNING | no translation language detected, skipping translation <frame at 0x7dca949e6f80, file '/data/build/duong-addons/d_crm_meta_lead_ads/wizards/meta_ad_composer.py', line 523, code money> | |
| 2026-10-17 17:29:48 | WARNING | Facebook file not downloaded: HTTP 500 | |
| 2026-10-17 17:29:48 | WARNING | Facebook file not downloaded: HTTP 500 | |
| 2026-10-17 17:29:48 | WARNING | Facebook file not downloaded: HTTP 500 | |
| 2026-10-17 17:29:48 | WARNING | Facebook file not downloaded: HTTP 500 | |
| 2026-10-17 17:29:49 | WARNING | Facebook file not downloaded: HTTP 500 | |
| 2026-10-17 17:29:49 | WARNING | Facebook file not downloaded: HTTP 500 | |
| 2026-10-17 17:29:49 | WARNING | Facebook file not downloaded: HTTP 500 | |
| 2026-10-17 17:29:49 | WARNING | Facebook file not downloaded: HTTP 500 | |
| 2026-10-17 17:29:49 | WARNING | Facebook file not downloaded: HTTP 500 | |
| 2026-10-17 17:29:49 | WARNING | Facebook file not downloaded: HTTP 500 | |
| 2026-10-17 17:29:49 | WARNING | Facebook file not downloaded: over 1000 bytes | |
| 2026-10-17 17:29:49 | WARNING | Facebook file not downloaded: over 1000 bytes | |
| 2026-10-17 17:29:49 | WARNING | Facebook file not downloaded: over 1000 bytes | |
| 2026-10-17 17:29:49 | WARNING | Facebook file not downloaded: HTTP 500 | |
| 2026-10-17 17:29:49 | WARNING | Facebook file not downloaded: ConnectionError | |
| 2026-10-17 17:29:49 | WARNING | Facebook file not downloaded: ConnectionError | |
| 2026-10-17 17:29:49 | WARNING | Facebook file not downloaded: HTTP 500 | |
| 2026-10-17 17:29:49 | WARNING | Facebook file not downloaded: HTTP 500 | |
| 2026-10-17 17:29:49 | WARNING | Facebook file not downloaded: ConnectionError | |
| 2026-10-17 17:29:50 | WARNING | Facebook file not downloaded: HTTP 500 | |
| 2026-10-17 17:29:50 | WARNING | Files of Facebook post 123456789_1 not fetched Traceback (most recent call last): File "/data/build/duong-addons/d_social_facebook/models/social_account.py", line 730, in _facebook_fetch_unlisted_media live_post._facebook_fetch_media(deadline=deadline) File "/data/build/duong-addons/d_social_facebook/models/social_post_live.py", line 36, in _facebook_fetch_media post_data = service.get_post_attachments(account._get_facebook_access_token(), live_post.facebook_post_id) ^^^^^^^^^^^^^^^^^^^^^^^^^^^^^^^^^^^^^^^^^^^^^^^^^^^^^^^^^^^^^^^^^^^^^^^^^^^^^^^^^^^^^^^^^^^^^^ File "/data/build/duong-addons/d_social_facebook/tests/test_facebook_post_media.py", line 372, in gone raise RuntimeError("the post does not exist any more") RuntimeError: the post does not exist any more | |
| 2026-10-17 17:29:50 | WARNING | Files of Facebook post 123456789_1 not fetched Traceback (most recent call last): File "/data/build/duong-addons/d_social_facebook/models/social_account.py", line 730, in _facebook_fetch_unlisted_media live_post._facebook_fetch_media(deadline=deadline) File "/data/build/duong-addons/d_social_facebook/models/social_post_live.py", line 36, in _facebook_fetch_media post_data = service.get_post_attachments(account._get_facebook_access_token(), live_post.facebook_post_id) ^^^^^^^^^^^^^^^^^^^^^^^^^^^^^^^^^^^^^^^^^^^^^^^^^^^^^^^^^^^^^^^^^^^^^^^^^^^^^^^^^^^^^^^^^^^^^^ File "/data/build/duong-addons/d_social_facebook/tests/test_facebook_post_media.py", line 372, in gone raise RuntimeError("the post does not exist any more") RuntimeError: the post does not exist any more | |
| 2026-10-17 17:29:50 | WARNING | Facebook file not downloaded: HTTP 500 | |
| 2026-10-17 17:29:50 | WARNING | Facebook file not downloaded: HTTP 500 | |
| 2026-10-17 17:29:50 | WARNING | Picture of Facebook post 123456789_2 not usable | |
| 2026-10-17 17:29:51 | WARNING | Facebook file not downloaded: too slow for a synchronisation | |
| 2026-10-17 17:29:51 | WARNING | Facebook file not downloaded: too slow for a synchronisation | |
| 2026-10-17 17:29:51 | WARNING | Facebook file not downloaded: too slow for a synchronisation | |
| 2026-10-17 17:29:52 | WARNING | Facebook post sync response too large, retrying from the same cursor with 5 posts per request: Page ID: 123456789 | Endpoint: /123456789/published_posts | Batch: 1 | Fetched: 0 | Cursor: initial | |
| 2026-10-17 17:29:52 | WARNING | Facebook post sync response too large, retrying from the same cursor with 1 posts per request: Page ID: 123456789 | Endpoint: /123456789/published_posts | Batch: 2 | Fetched: 0 | Cursor: initial | |
| 2026-10-17 17:29:52 | ERROR | Facebook post sync request failed: Page ID: 123456789 | Endpoint: /123456789/published_posts | Batch: 3 | Fetched: 0 | Cursor: initial | Meta API error: too large | Code: 1 | |
| 2026-10-17 17:29:52 | ERROR | Error syncing Facebook posts: Facebook post sync request failed: Page ID: 123456789 | Endpoint: /123456789/published_posts | Batch: 3 | Fetched: 0 | Cursor: initial | Meta API error: too large | Code: 1 | |
| 2026-10-17 17:34:36 | ERROR | 2 failed, 0 error(s) of 877 tests when loading database '02299-19-0-all' | |
| 2026-10-17 17:34:56 | INFO | Getting results for build 02299-19-0 | |
| 2026-10-17 17:34:56 | Step test_post_install finished in 11m |