| Date (UTC) | Level | Message | |
|---|---|---|---|
| 2026-10-17 20:25:03 | INFO | Init build environment with config duong-addons-run-test | |
| 2026-10-17 20:25:03 | Starting step restore from config duong-addons-run-test | ||
| 2026-10-17 20:25:03 | Restoring template 02293-19-0-all.zip from build 2293 | ||
| 2026-10-17 20:25:03 | Using Dockerfile Tag odoo:Docker19 | ||
| 2026-10-17 20:25:54 | INFO | Step restore finished in 48s | |
| 2026-10-17 20:25:54 | Starting step test_post_install from config duong-addons-run-test | ||
| 2026-10-17 20:25:54 | Using Dockerfile Tag odoo:Docker19 | ||
| 2026-10-17 20:26:00 | INFO | 1 modules loaded in 0.65s, 0 queries (+0 extra) | |
| 2026-10-17 20:26:13 | INFO | 322 modules loaded in 12.88s, 0 queries (+0 extra) | |
| 2026-10-17 20:26:15 | INFO | Pregenerating assets bundles | |
| 2026-10-17 20:30:19 | ERROR | ERROR: TestSocialApprovalCompanySettings.test_non_manager_posts_only_request_approval_for_enabled_company Traceback (most recent call last): File "/data/build/duong-addons/d_social_approval/tests/test_social_approval_company.py", line 149, in test_non_manager_posts_only_request_approval_for_enabled_company (approval_post | direct_post).with_user(self.social_user).action_post() File "/data/build/duong-addons/d_social_approval/models/social_post.py", line 186, in action_post return self.action_request_approval() ^^^^^^^^^^^^^^^^^^^^^^^^^^^^^^ File "/data/build/duong-addons/d_social_approval/models/social_post.py", line 118, in action_request_approval live_posts |= super(SocialPost, direct_posts).action_post() ^^^^^^^^^^^^^^^^^^^^^^^^^^^^^^^^^^^^^^^^^^^^^ File "/data/build/duong-addons/d_social/models/social_post.py", line 293, in action_post r.write({'state': 'posting'}) File "/data/build/duong-addons/d_social_approval/models/social_post.py", line 224, in write return super().write(vals) ^^^^^^^^^^^^^^^^^^^ File "/data/build/duong-addons/d_social/models/social_post.py", line 190, in write result = super().write(vals) ^^^^^^^^^^^^^^^^^^^ File "/data/build/odoo/addons/mail/models/mail_thread.py", line 392, in write result = super().write(vals) ^^^^^^^^^^^^^^^^^^^ File "/data/build/odoo/odoo/orm/models.py", line 4384, in write self.check_access('write') File "/data/build/odoo/odoo/orm/models.py", line 4121, in check_access raise result[1]() odoo.exceptions.AccessError: Uh-oh! Looks like you have stumbled upon some top-secret records. Sorry, Social Approval User (id=22) doesn't have 'write' access to: - Social Post (d.social.post) If you really, really need access, perhaps you can win over your friendly administrator with a batch of freshly baked cookies. This seems to be a multi-company issue, you might be able to access the record by switching to the company: Social Direct Company. | |
| 2026-10-17 20:30:19 | ERROR | ERROR: TestSocialApprovalCompanySettings.test_parent_post_unlink_does_not_trigger_remote_unlink Traceback (most recent call last): File "/data/build/duong-addons/d_social_approval/tests/test_social_approval_company.py", line 430, in test_parent_post_unlink_does_not_trigger_remote_unlink live_post = self._create_live_post( ^^^^^^^^^^^^^^^^^^^^^^^ File "/data/build/duong-addons/d_social_approval/tests/test_social_approval_company.py", line 95, in _create_live_post return self.env['d.social.post.live'].with_company(company).create({ ^^^^^^^^^^^^^^^^^^^^^^^^^^^^^^^^^^^^^^^^^^^^^^^^^^^^^^^^^^^^^ File "/data/build/odoo/odoo/orm/decorators.py", line 369, in create return method(self, vals_list) ^^^^^^^^^^^^^^^^^^^^^^^ File "/data/build/odoo/addons/mail/models/mail_thread.py", line 329, in create threads = super(MailThread, self).create(vals_list) ^^^^^^^^^^^^^^^^^^^^^^^^^^^^^^^^^^^^^^^^^ File "/data/build/odoo/odoo/orm/decorators.py", line 369, in create return method(self, vals_list) ^^^^^^^^^^^^^^^^^^^^^^^ File "/data/build/odoo/odoo/orm/models.py", line 4660, in create raise ValueError(f"Invalid field {field_name!r} in {self._name!r}") ValueError: Invalid field 'name' in 'd.social.post.live' | |
| 2026-10-17 20:30:19 | ERROR | ERROR: TestSocialApprovalCompanySettings.test_remote_unlink_sync_disabled_deletes_locally_without_remote_call Traceback (most recent call last): File "/data/build/duong-addons/d_social_approval/tests/test_social_approval_company.py", line 256, in test_remote_unlink_sync_disabled_deletes_locally_without_remote_call live_post = self._create_live_post( ^^^^^^^^^^^^^^^^^^^^^^^ File "/data/build/duong-addons/d_social_approval/tests/test_social_approval_company.py", line 95, in _create_live_post return self.env['d.social.post.live'].with_company(company).create({ ^^^^^^^^^^^^^^^^^^^^^^^^^^^^^^^^^^^^^^^^^^^^^^^^^^^^^^^^^^^^^ File "/data/build/odoo/odoo/orm/decorators.py", line 369, in create return method(self, vals_list) ^^^^^^^^^^^^^^^^^^^^^^^ File "/data/build/odoo/addons/mail/models/mail_thread.py", line 329, in create threads = super(MailThread, self).create(vals_list) ^^^^^^^^^^^^^^^^^^^^^^^^^^^^^^^^^^^^^^^^^ File "/data/build/odoo/odoo/orm/decorators.py", line 369, in create return method(self, vals_list) ^^^^^^^^^^^^^^^^^^^^^^^ File "/data/build/odoo/odoo/orm/models.py", line 4660, in create raise ValueError(f"Invalid field {field_name!r} in {self._name!r}") ValueError: Invalid field 'name' in 'd.social.post.live' | |
| 2026-10-17 20:30:19 | ERROR | ERROR: TestSocialApprovalCompanySettings.test_remote_unlink_sync_enabled_deletes_remote_before_local_unlink Traceback (most recent call last): File "/data/build/duong-addons/d_social_approval/tests/test_social_approval_company.py", line 340, in test_remote_unlink_sync_enabled_deletes_remote_before_local_unlink live_post = self._create_live_post( ^^^^^^^^^^^^^^^^^^^^^^^ File "/data/build/duong-addons/d_social_approval/tests/test_social_approval_company.py", line 95, in _create_live_post return self.env['d.social.post.live'].with_company(company).create({ ^^^^^^^^^^^^^^^^^^^^^^^^^^^^^^^^^^^^^^^^^^^^^^^^^^^^^^^^^^^^^ File "/data/build/odoo/odoo/orm/decorators.py", line 369, in create return method(self, vals_list) ^^^^^^^^^^^^^^^^^^^^^^^ File "/data/build/odoo/addons/mail/models/mail_thread.py", line 329, in create threads = super(MailThread, self).create(vals_list) ^^^^^^^^^^^^^^^^^^^^^^^^^^^^^^^^^^^^^^^^^ File "/data/build/odoo/odoo/orm/decorators.py", line 369, in create return method(self, vals_list) ^^^^^^^^^^^^^^^^^^^^^^^ File "/data/build/odoo/odoo/orm/models.py", line 4660, in create raise ValueError(f"Invalid field {field_name!r} in {self._name!r}") ValueError: Invalid field 'name' in 'd.social.post.live' | |
| 2026-10-17 20:30:19 | ERROR | ERROR: TestSocialApprovalCompanySettings.test_remote_unlink_sync_enabled_requires_supported_remote_identifier Traceback (most recent call last): File "/data/build/duong-addons/d_social_approval/tests/test_social_approval_company.py", line 322, in test_remote_unlink_sync_enabled_requires_supported_remote_identifier live_post = self._create_live_post( ^^^^^^^^^^^^^^^^^^^^^^^ File "/data/build/duong-addons/d_social_approval/tests/test_social_approval_company.py", line 95, in _create_live_post return self.env['d.social.post.live'].with_company(company).create({ ^^^^^^^^^^^^^^^^^^^^^^^^^^^^^^^^^^^^^^^^^^^^^^^^^^^^^^^^^^^^^ File "/data/build/odoo/odoo/orm/decorators.py", line 369, in create return method(self, vals_list) ^^^^^^^^^^^^^^^^^^^^^^^ File "/data/build/odoo/addons/mail/models/mail_thread.py", line 329, in create threads = super(MailThread, self).create(vals_list) ^^^^^^^^^^^^^^^^^^^^^^^^^^^^^^^^^^^^^^^^^ File "/data/build/odoo/odoo/orm/decorators.py", line 369, in create return method(self, vals_list) ^^^^^^^^^^^^^^^^^^^^^^^ File "/data/build/odoo/odoo/orm/models.py", line 4660, in create raise ValueError(f"Invalid field {field_name!r} in {self._name!r}") ValueError: Invalid field 'name' in 'd.social.post.live' | |
| 2026-10-17 20:30:20 | ERROR | ERROR: TestSocialApprovalCompanySettings.test_remote_unlink_sync_failure_keeps_live_post Traceback (most recent call last): File "/data/build/duong-addons/d_social_approval/tests/test_social_approval_company.py", line 377, in test_remote_unlink_sync_failure_keeps_live_post live_post = self._create_live_post( ^^^^^^^^^^^^^^^^^^^^^^^ File "/data/build/duong-addons/d_social_approval/tests/test_social_approval_company.py", line 95, in _create_live_post return self.env['d.social.post.live'].with_company(company).create({ ^^^^^^^^^^^^^^^^^^^^^^^^^^^^^^^^^^^^^^^^^^^^^^^^^^^^^^^^^^^^^ File "/data/build/odoo/odoo/orm/decorators.py", line 369, in create return method(self, vals_list) ^^^^^^^^^^^^^^^^^^^^^^^ File "/data/build/odoo/addons/mail/models/mail_thread.py", line 329, in create threads = super(MailThread, self).create(vals_list) ^^^^^^^^^^^^^^^^^^^^^^^^^^^^^^^^^^^^^^^^^ File "/data/build/odoo/odoo/orm/decorators.py", line 369, in create return method(self, vals_list) ^^^^^^^^^^^^^^^^^^^^^^^ File "/data/build/odoo/odoo/orm/models.py", line 4660, in create raise ValueError(f"Invalid field {field_name!r} in {self._name!r}") ValueError: Invalid field 'name' in 'd.social.post.live' | |
| 2026-10-17 20:30:20 | ERROR | ERROR: TestSocialApprovalCompanySettings.test_remote_unlink_sync_ignores_not_posted_states Traceback (most recent call last): File "/data/build/duong-addons/d_social_approval/tests/test_social_approval_company.py", line 412, in test_remote_unlink_sync_ignores_not_posted_states live_posts |= self._create_live_post( ^^^^^^^^^^^^^^^^^^^^^^^ File "/data/build/duong-addons/d_social_approval/tests/test_social_approval_company.py", line 95, in _create_live_post return self.env['d.social.post.live'].with_company(company).create({ ^^^^^^^^^^^^^^^^^^^^^^^^^^^^^^^^^^^^^^^^^^^^^^^^^^^^^^^^^^^^^ File "/data/build/odoo/odoo/orm/decorators.py", line 369, in create return method(self, vals_list) ^^^^^^^^^^^^^^^^^^^^^^^ File "/data/build/odoo/addons/mail/models/mail_thread.py", line 329, in create threads = super(MailThread, self).create(vals_list) ^^^^^^^^^^^^^^^^^^^^^^^^^^^^^^^^^^^^^^^^^ File "/data/build/odoo/odoo/orm/decorators.py", line 369, in create return method(self, vals_list) ^^^^^^^^^^^^^^^^^^^^^^^ File "/data/build/odoo/odoo/orm/models.py", line 4660, in create raise ValueError(f"Invalid field {field_name!r} in {self._name!r}") ValueError: Invalid field 'name' in 'd.social.post.live' | |
| 2026-10-17 20:30:20 | ERROR | ERROR: TestSocialApprovalCompanySettings.test_remote_unlink_sync_uses_parent_post_company_setting Traceback (most recent call last): File "/data/build/duong-addons/d_social_approval/tests/test_social_approval_company.py", line 278, in test_remote_unlink_sync_uses_parent_post_company_setting sync_live_post = self._create_live_post( ^^^^^^^^^^^^^^^^^^^^^^^ File "/data/build/duong-addons/d_social_approval/tests/test_social_approval_company.py", line 95, in _create_live_post return self.env['d.social.post.live'].with_company(company).create({ ^^^^^^^^^^^^^^^^^^^^^^^^^^^^^^^^^^^^^^^^^^^^^^^^^^^^^^^^^^^^^ File "/data/build/odoo/odoo/orm/decorators.py", line 369, in create return method(self, vals_list) ^^^^^^^^^^^^^^^^^^^^^^^ File "/data/build/odoo/addons/mail/models/mail_thread.py", line 329, in create threads = super(MailThread, self).create(vals_list) ^^^^^^^^^^^^^^^^^^^^^^^^^^^^^^^^^^^^^^^^^ File "/data/build/odoo/odoo/orm/decorators.py", line 369, in create return method(self, vals_list) ^^^^^^^^^^^^^^^^^^^^^^^ File "/data/build/odoo/odoo/orm/models.py", line 4660, in create raise ValueError(f"Invalid field {field_name!r} in {self._name!r}") ValueError: Invalid field 'name' in 'd.social.post.live' | |
| 2026-10-17 20:34:09 | ERROR | 0 failed, 8 error(s) of 684 tests when loading database '02311-19-0-all' | |
| 2026-10-17 20:34:25 | INFO | Getting results for build 02311-19-0 | |
| 2026-10-17 20:34:25 | Step test_post_install finished in 8m |