Description: Test pylint
Commit: duong-addons:a626afad  
Subject: [FIX] website controllers: raise request.not_found() instead of returning it
Author: Claude
Committer: Nguyễn Đại Dương
Commit: odoo:99edb6dd  
Subject: [IMP] account_edi_ubl_cii: Support section in UBL.
Author: Jugurtha
Commit: odoo-enteprise:36e91262  
Subject: [MISC] odoo enterprise 19 29/8/2026
Author: daiduongnguyen-odoo
Commit: duong-addons-ee:5b3a3b3f  
Subject: [FIX] d_ee_social_douyin: add Douyin tab to the post template form notebook
Author: Claude
Build time: 62m
Wait time: 74m
Load time: 1h2m
Date (UTC) Level Message
2026-10-17 20:56:08 INFO Init build environment with config duong-addons-run-test
2026-10-17 20:56:08 Starting step test_pylint from config duong-addons-run-test
2026-10-17 20:56:08 Using Dockerfile Tag odoo:Docker19
2026-10-17 20:56:31 INFO 1 modules loaded in 12.78s, 8375 queries (+8375 extra)
2026-10-17 20:57:00 ERROR FAIL: Subtest ManifestLinter.test_manifests (module='d_ee_social_dashboard_douyin') Traceback (most recent call last): File "/data/build/odoo/odoo/addons/test_lint/tests/test_manifests.py", line 32, in test_manifests self._test_manifest_values(manifest) File "/data/build/odoo/odoo/addons/test_lint/tests/test_manifests.py", line 56, in _test_manifest_values self.assertNotEqual( AssertionError: [] == [] : Setting manifest key data to the default manifest value for module 'd_ee_social_dashboard_douyin'. You can remove this key from the dict to reduce noise/inconsistencies between manifests specifications and ease understanding of manifest content.
2026-10-17 20:57:50 INFO pylint version: 3.0.3
2026-10-17 21:58:12 ERROR FAIL: TestPyLint.test_pylint Traceback (most recent call last): File "/data/build/odoo/odoo/addons/test_lint/tests/test_pylint.py", line 109, in test_pylint self.fail(f"pylint test failed:\n\n{r.stdout}\n{r.stderr}".strip()) AssertionError: pylint test failed: ************* Module d_ee_social_tiktok_business.models.social_account Usage of _, _lt function with multiple unnamed placeholders (E8505) at duong-addons-ee/d_ee_social_tiktok_business/models/social_account.py:550 Usage of _, _lt function with multiple unnamed placeholders (E8505) at duong-addons-ee/d_ee_social_tiktok_business/models/social_account.py:556 ************* Module d_ee_social_messenger_base.models.messenger_base_template_variable Static string passed to ValidationError without gettext call. (E8507) at duong-addons-ee/d_ee_social_messenger_base/models/messenger_base_template_variable.py:55 ************* Module d_ee_social_messenger_base.models.messenger_base_api Usage of _, _lt function with multiple unnamed placeholders (E8505) at duong-addons-ee/d_ee_social_messenger_base/models/messenger_base_api.py:41 Usage of _, _lt function with multiple unnamed placeholders (E8505) at duong-addons-ee/d_ee_social_messenger_base/models/messenger_base_api.py:53 Usage of _, _lt function with multiple unnamed placeholders (E8505) at duong-addons-ee/d_ee_social_messenger_base/models/messenger_base_api.py:66 Usage of _, _lt function with multiple unnamed placeholders (E8505) at duong-addons-ee/d_ee_social_messenger_base/models/messenger_base_api.py:79 Usage of _, _lt function with multiple unnamed placeholders (E8505) at duong-addons-ee/d_ee_social_messenger_base/models/messenger_base_api.py:92 Usage of _, _lt function with multiple unnamed placeholders (E8505) at duong-addons-ee/d_ee_social_messenger_base/models/messenger_base_api.py:107 ************* Module d_ee_social_douyin.models.social_live_post Usage of _, _lt function with multiple unnamed placeholders (E8505) at duong-addons-ee/d_ee_social_douyin/models/social_live_post.py:189 ************* Module d_ee_social_tiktok_messaging.models.tiktok_auto_message Raise inside unlink override. (E8503) at duong-addons-ee/d_ee_social_tiktok_messaging/models/tiktok_auto_message.py:198 ************* Module d_ee_social_tiktok_messaging.models.tiktok_messaging_api Usage of _, _lt function with multiple unnamed placeholders (E8505) at duong-addons-ee/d_ee_social_tiktok_messaging/models/tiktok_messaging_api.py:54 Usage of _, _lt function with multiple unnamed placeholders (E8505) at duong-addons-ee/d_ee_social_tiktok_messaging/models/tiktok_messaging_api.py:56 Usage of _, _lt function with multiple unnamed placeholders (E8505) at duong-addons-ee/d_ee_social_tiktok_messaging/models/tiktok_messaging_api.py:58 ************* Module d_ee_social_facebook_messenger.models.messenger_template_button Static string passed to ValidationError without gettext call. (E8507) at duong-addons-ee/d_ee_social_facebook_messenger/models/messenger_template_button.py:42 Static string passed to ValidationError without gettext call. (E8507) at duong-addons-ee/d_ee_social_facebook_messenger/models/messenger_template_button.py:44 Static string passed to ValidationError without gettext call. (E8507) at duong-addons-ee/d_ee_social_facebook_messenger/models/messenger_template_button.py:46 Static string passed to ValidationError without gettext call. (E8507) at duong-addons-ee/d_ee_social_facebook_messenger/models/messenger_template_button.py:48 ************* Module d_ee_social_facebook_messenger.models.messenger_template_element Static string passed to ValidationError without gettext call. (E8507) at duong-addons-ee/d_ee_social_facebook_messenger/models/messenger_template_element.py:50 Static string passed to ValidationError without gettext call. (E8507) at duong-addons-ee/d_ee_social_facebook_messenger/models/messenger_template_element.py:56 ************* Module d_ee_social_facebook_messenger.models.facebook_messenger_api Static string passed to UserError without gettext call. (E8507) at duong-addons-ee/d_ee_social_facebook_messenger/models/facebook_messenger_api.py:137 Static string passed to UserError without gettext call. (E8507) at duong-addons-ee/d_ee_social_facebook_messenger/models/facebook_messenger_api.py:154 Static string passed to UserError without gettext call. (E8507) at duong-addons-ee/d_ee_social_facebook_messenger/models/facebook_messenger_api.py:172 ************* Module d_ee_social_facebook_messenger.models.messenger_meta_template_variable Static string passed to ValidationError without gettext call. (E8507) at duong-addons-ee/d_ee_social_facebook_messenger/models/messenger_meta_template_variable.py:32 Static string passed to ValidationError without gettext call. (E8507) at duong-addons-ee/d_ee_social_facebook_messenger/models/messenger_meta_template_variable.py:54 ------------------------------------ Your code has been rated at 10.00/10 <unknown>:736: SyntaxWarning: invalid escape sequence '\-' <unknown>:1219: SyntaxWarning: invalid escape sequence '\;' <unknown>:1219: SyntaxWarning: invalid escape sequence '\,'
2026-10-17 21:58:18 ERROR Module test_lint: 2 failures, 0 errors of 24 tests
2026-10-17 21:58:30 INFO 23 modules loaded in 3714.75s, 8951 queries (+9003 extra)
2026-10-17 21:58:30 ERROR At least one test failed when loading the modules.
2026-10-17 21:58:30 ERROR 2 failed, 0 error(s) of 24 tests when loading database '02330-19-0-all'
2026-10-17 21:58:36 INFO Getting results for build 02330-19-0
2026-10-17 21:58:36 Step test_pylint finished in 62m