| Date (UTC) | Level | Message | |
|---|---|---|---|
| 2026-10-18 06:53:25 | INFO | Init build environment with config duong-addons-run-test | |
| 2026-10-18 06:53:25 | Starting step test_pylint from config duong-addons-run-test | ||
| 2026-10-18 06:53:25 | Using Dockerfile Tag odoo:Docker19 | ||
| 2026-10-18 06:53:51 | INFO | 1 modules loaded in 13.59s, 8375 queries (+8375 extra) | |
| 2026-10-18 06:54:26 | ERROR | FAIL: Subtest ManifestLinter.test_manifests (module='d_ee_social_dashboard_douyin') Traceback (most recent call last): File "/data/build/odoo/odoo/addons/test_lint/tests/test_manifests.py", line 32, in test_manifests self._test_manifest_values(manifest) File "/data/build/odoo/odoo/addons/test_lint/tests/test_manifests.py", line 56, in _test_manifest_values self.assertNotEqual( AssertionError: [] == [] : Setting manifest key data to the default manifest value for module 'd_ee_social_dashboard_douyin'. You can remove this key from the dict to reduce noise/inconsistencies between manifests specifications and ease understanding of manifest content. | |
| 2026-10-18 06:55:22 | INFO | pylint version: 3.0.3 | |
| 2026-10-18 08:16:54 | ERROR | FAIL: TestPyLint.test_pylint Traceback (most recent call last): File "/data/build/odoo/odoo/addons/test_lint/tests/test_pylint.py", line 109, in test_pylint self.fail(f"pylint test failed:\n\n{r.stdout}\n{r.stderr}".strip()) AssertionError: pylint test failed: ************* Module d_ee_social_douyin.models.social_live_post Usage of _, _lt function with multiple unnamed placeholders (E8505) at duong-addons-ee/d_ee_social_douyin/models/social_live_post.py:189 ************* Module d_ee_social_facebook_messenger.models.messenger_template_button Static string passed to ValidationError without gettext call. (E8507) at duong-addons-ee/d_ee_social_facebook_messenger/models/messenger_template_button.py:42 Static string passed to ValidationError without gettext call. (E8507) at duong-addons-ee/d_ee_social_facebook_messenger/models/messenger_template_button.py:44 Static string passed to ValidationError without gettext call. (E8507) at duong-addons-ee/d_ee_social_facebook_messenger/models/messenger_template_button.py:46 Static string passed to ValidationError without gettext call. (E8507) at duong-addons-ee/d_ee_social_facebook_messenger/models/messenger_template_button.py:48 ************* Module d_ee_social_facebook_messenger.models.messenger_template_element Static string passed to ValidationError without gettext call. (E8507) at duong-addons-ee/d_ee_social_facebook_messenger/models/messenger_template_element.py:50 Static string passed to ValidationError without gettext call. (E8507) at duong-addons-ee/d_ee_social_facebook_messenger/models/messenger_template_element.py:56 ************* Module d_ee_social_facebook_messenger.models.facebook_messenger_api Static string passed to UserError without gettext call. (E8507) at duong-addons-ee/d_ee_social_facebook_messenger/models/facebook_messenger_api.py:137 Static string passed to UserError without gettext call. (E8507) at duong-addons-ee/d_ee_social_facebook_messenger/models/facebook_messenger_api.py:154 Static string passed to UserError without gettext call. (E8507) at duong-addons-ee/d_ee_social_facebook_messenger/models/facebook_messenger_api.py:172 ************* Module d_ee_social_facebook_messenger.models.messenger_meta_template_variable Static string passed to ValidationError without gettext call. (E8507) at duong-addons-ee/d_ee_social_facebook_messenger/models/messenger_meta_template_variable.py:32 Static string passed to ValidationError without gettext call. (E8507) at duong-addons-ee/d_ee_social_facebook_messenger/models/messenger_meta_template_variable.py:54 ************* Module d_ee_social_tiktok_business.models.social_account Usage of _, _lt function with multiple unnamed placeholders (E8505) at duong-addons-ee/d_ee_social_tiktok_business/models/social_account.py:550 Usage of _, _lt function with multiple unnamed placeholders (E8505) at duong-addons-ee/d_ee_social_tiktok_business/models/social_account.py:556 ************* Module d_ee_social_messenger_base.models.messenger_base_template_variable Static string passed to ValidationError without gettext call. (E8507) at duong-addons-ee/d_ee_social_messenger_base/models/messenger_base_template_variable.py:55 ************* Module d_ee_social_messenger_base.models.messenger_base_api Usage of _, _lt function with multiple unnamed placeholders (E8505) at duong-addons-ee/d_ee_social_messenger_base/models/messenger_base_api.py:41 Usage of _, _lt function with multiple unnamed placeholders (E8505) at duong-addons-ee/d_ee_social_messenger_base/models/messenger_base_api.py:53 Usage of _, _lt function with multiple unnamed placeholders (E8505) at duong-addons-ee/d_ee_social_messenger_base/models/messenger_base_api.py:66 Usage of _, _lt function with multiple unnamed placeholders (E8505) at duong-addons-ee/d_ee_social_messenger_base/models/messenger_base_api.py:79 Usage of _, _lt function with multiple unnamed placeholders (E8505) at duong-addons-ee/d_ee_social_messenger_base/models/messenger_base_api.py:92 Usage of _, _lt function with multiple unnamed placeholders (E8505) at duong-addons-ee/d_ee_social_messenger_base/models/messenger_base_api.py:107 ************* Module d_ee_social_tiktok_messaging.models.tiktok_auto_message Raise inside unlink override. (E8503) at duong-addons-ee/d_ee_social_tiktok_messaging/models/tiktok_auto_message.py:198 ************* Module d_ee_social_tiktok_messaging.models.tiktok_messaging_api Usage of _, _lt function with multiple unnamed placeholders (E8505) at duong-addons-ee/d_ee_social_tiktok_messaging/models/tiktok_messaging_api.py:54 Usage of _, _lt function with multiple unnamed placeholders (E8505) at duong-addons-ee/d_ee_social_tiktok_messaging/models/tiktok_messaging_api.py:56 Usage of _, _lt function with multiple unnamed placeholders (E8505) at duong-addons-ee/d_ee_social_tiktok_messaging/models/tiktok_messaging_api.py:58 ------------------------------------ Your code has been rated at 10.00/10 <unknown>:736: SyntaxWarning: invalid escape sequence '\-' <unknown>:1219: SyntaxWarning: invalid escape sequence '\;' <unknown>:1219: SyntaxWarning: invalid escape sequence '\,' | |
| 2026-10-18 08:17:16 | ERROR | Module test_lint: 2 failures, 0 errors of 24 tests | |
| 2026-10-18 08:17:35 | INFO | 23 modules loaded in 5019.27s, 8951 queries (+9003 extra) | |
| 2026-10-18 08:17:36 | ERROR | At least one test failed when loading the modules. | |
| 2026-10-18 08:17:36 | ERROR | 2 failed, 0 error(s) of 24 tests when loading database '02375-19-0-all' | |
| 2026-10-18 08:17:46 | INFO | Getting results for build 02375-19-0 | |
| 2026-10-18 08:17:46 | Step test_pylint finished in 84m |