Description: Post install tests for m -> !s
Commit: duong-addons:102ed130  
Subject: [FIX] d_social_content_tank*, d_social_facebook, d_crm_meta_lead_ads: runbot warnings of Odoo 19
Author: daiduongnguyen-odoo
Commit: odoo:99edb6dd  
Subject: [IMP] account_edi_ubl_cii: Support section in UBL.
Author: Jugurtha
Commit: odoo-enteprise:36e91262  
Subject: [MISC] odoo enterprise 19 29/8/2026
Author: daiduongnguyen-odoo
Commit: duong-addons-ee:7c580bbb  
Subject: [DOC] TikTok Messaging: distinguish optional Business IAP setup from required messaging credentials
Author: Nguyễn Đại Dương
Build time: 9m
Wait time: 67m
Load time: 8m43s
Date (UTC) Level Message
2026-10-20 07:19:37 INFO Init build environment with config duong-addons-run-test
2026-10-20 07:19:37 Starting step restore from config duong-addons-run-test
2026-10-20 07:19:37 Restoring template 02456-19-0-all.zip from build 2456
2026-10-20 07:19:37 Using Dockerfile Tag odoo:Docker19
2026-10-20 07:20:17 INFO Step restore finished in 39s
2026-10-20 07:20:17 Starting step test_post_install from config duong-addons-run-test
2026-10-20 07:20:17 Using Dockerfile Tag odoo:Docker19
2026-10-20 07:20:24 INFO 1 modules loaded in 0.84s, 0 queries (+0 extra)
2026-10-20 07:20:30 INFO 123 modules loaded in 6.31s, 0 queries (+0 extra)
2026-10-20 07:20:31 INFO Pregenerating assets bundles
2026-10-20 07:27:02 ERROR FAIL: TestPaymentTransaction.test_capture_allowed_for_authorized_users Traceback (most recent call last): File "/data/build/odoo/addons/payment/tests/common.py", line 230, in _assert_does_not_raise func(*args, **kwargs) File "/data/build/odoo/addons/payment/models/payment_transaction.py", line 273, in action_capture payment_utils.check_rights_on_recordset(self) odoo.exceptions.AccessError: You are not allowed to modify 'Payment Transaction' (payment.transaction) records. This operation is allowed for the following groups: - Role / Administrator Contact your administrator to request access if necessary. During handling of the above exception, another exception occurred: Traceback (most recent call last): File "/data/build/odoo/addons/payment/tests/test_payment_transaction.py", line 32, in test_capture_allowed_for_authorized_users self._assert_does_not_raise(AccessError, tx.with_user(user).action_capture) File "/data/build/odoo/addons/payment/tests/common.py", line 232, in _assert_does_not_raise self.fail(f"{func.__name__} should not raise error of class {exception_class.__name__}") AssertionError: action_capture should not raise error of class AccessError
2026-10-20 07:27:03 ERROR FAIL: TestPaymentTransaction.test_refund_allowed_for_authorized_users Traceback (most recent call last): File "/data/build/odoo/addons/payment/tests/common.py", line 230, in _assert_does_not_raise func(*args, **kwargs) File "/data/build/odoo/addons/payment/models/payment_transaction.py", line 319, in action_refund payment_utils.check_rights_on_recordset(self) odoo.exceptions.AccessError: You are not allowed to modify 'Payment Transaction' (payment.transaction) records. This operation is allowed for the following groups: - Role / Administrator Contact your administrator to request access if necessary. During handling of the above exception, another exception occurred: Traceback (most recent call last): File "/data/build/odoo/addons/payment/tests/test_payment_transaction.py", line 50, in test_refund_allowed_for_authorized_users self._assert_does_not_raise(AccessError, tx.with_user(user).action_refund) File "/data/build/odoo/addons/payment/tests/common.py", line 232, in _assert_does_not_raise self.fail(f"{func.__name__} should not raise error of class {exception_class.__name__}") AssertionError: action_refund should not raise error of class AccessError
2026-10-20 07:27:03 ERROR FAIL: TestPaymentTransaction.test_void_allowed_for_authorized_users Traceback (most recent call last): File "/data/build/odoo/addons/payment/tests/common.py", line 230, in _assert_does_not_raise func(*args, **kwargs) File "/data/build/odoo/addons/payment/models/payment_transaction.py", line 298, in action_void payment_utils.check_rights_on_recordset(self) odoo.exceptions.AccessError: You are not allowed to modify 'Payment Transaction' (payment.transaction) records. This operation is allowed for the following groups: - Role / Administrator Contact your administrator to request access if necessary. During handling of the above exception, another exception occurred: Traceback (most recent call last): File "/data/build/odoo/addons/payment/tests/test_payment_transaction.py", line 41, in test_void_allowed_for_authorized_users self._assert_does_not_raise(AccessError, tx.with_user(user).action_void) File "/data/build/odoo/addons/payment/tests/common.py", line 232, in _assert_does_not_raise self.fail(f"{func.__name__} should not raise error of class {exception_class.__name__}") AssertionError: action_void should not raise error of class AccessError
2026-10-20 07:28:10 ERROR 3 failed, 0 error(s) of 465 tests when loading database '02477-19-0-all'
2026-10-20 07:28:20 INFO Getting results for build 02477-19-0
2026-10-20 07:28:20 Step test_post_install finished in 8m