| Date (UTC) | Level | Message | |
|---|---|---|---|
| 2026-10-10 18:37:21 | INFO | Init build environment with config duong-addons-run-test | |
| 2026-10-10 18:37:21 | Starting step restore from config duong-addons-run-test | ||
| 2026-10-10 18:37:21 | Restoring template 02110-19-0-all.zip from build 2110 | ||
| 2026-10-10 18:37:21 | Using Dockerfile Tag odoo:Docker19 | ||
| 2026-10-10 18:38:52 | INFO | Step restore finished in 86s | |
| 2026-10-10 18:38:52 | Starting step test_post_install from config duong-addons-run-test | ||
| 2026-10-10 18:38:52 | Using Dockerfile Tag odoo:Docker19 | ||
| 2026-10-10 18:39:09 | INFO | 1 modules loaded in 2.16s, 0 queries (+0 extra) | |
| 2026-10-10 18:39:32 | INFO | 308 modules loaded in 22.26s, 0 queries (+0 extra) | |
| 2026-10-10 18:39:35 | INFO | Pregenerating assets bundles | |
| 2026-10-10 18:44:22 | WARNING | Meta dashboard insights failed for ad account 4 Traceback (most recent call last): File "/data/build/duong-addons/d_crm_meta_lead_ads/models/meta_ad_models.py", line 486, in get_dashboard_insights date_from, date_to = self._validate_dashboard_range(date_from, date_to) ^^^^^^^^^^^^^^^^^^^^^^^^^^^^^^^^^^^^^^^^^^^^^^^^^^ File "/data/build/duong-addons/d_crm_meta_lead_ads/models/meta_ad_models.py", line 431, in _validate_dashboard_range raise UserError(_('The dashboard date range cannot start more than 37 months ago.')) odoo.exceptions.UserError: The dashboard date range cannot start more than 37 months ago. | |
| 2026-10-10 18:44:22 | WARNING | Meta dashboard insights failed for ad account 4 Traceback (most recent call last): File "/data/build/duong-addons/d_crm_meta_lead_ads/models/meta_ad_models.py", line 486, in get_dashboard_insights date_from, date_to = self._validate_dashboard_range(date_from, date_to) ^^^^^^^^^^^^^^^^^^^^^^^^^^^^^^^^^^^^^^^^^^^^^^^^^^ File "/data/build/duong-addons/d_crm_meta_lead_ads/models/meta_ad_models.py", line 427, in _validate_dashboard_range raise UserError(_('The dashboard date range cannot include a future date.')) odoo.exceptions.UserError: The dashboard date range cannot include a future date. | |
| 2026-10-10 18:44:22 | WARNING | Meta dashboard insights failed for ad account 4 Traceback (most recent call last): File "/data/build/duong-addons/d_crm_meta_lead_ads/models/meta_ad_models.py", line 486, in get_dashboard_insights date_from, date_to = self._validate_dashboard_range(date_from, date_to) ^^^^^^^^^^^^^^^^^^^^^^^^^^^^^^^^^^^^^^^^^^^^^^^^^^ File "/data/build/duong-addons/d_crm_meta_lead_ads/models/meta_ad_models.py", line 422, in _validate_dashboard_range date_from, date_to = self._normalize_insight_range(date_from, date_to) ^^^^^^^^^^^^^^^^^^^^^^^^^^^^^^^^^^^^^^^^^^^^^^^^^ File "/data/build/duong-addons/d_crm_meta_lead_ads/models/meta_ad_models.py", line 344, in _normalize_insight_range raise UserError(_('The insight start date must be on or before the end date.')) odoo.exceptions.UserError: The insight start date must be on or before the end date. | |
| 2026-10-10 18:45:50 | ERROR | ERROR: TestTikTokProductListingMapping.test_legacy_fields_create_a_listing_only_for_users_who_may_create_one Traceback (most recent call last): File "/data/build/duong-addons/d_tiktok_shop_connector_patch2/tests/test_product_listing_mapping.py", line 1230, in test_legacy_fields_create_a_listing_only_for_users_who_may_create_one self.env['product.template'].with_user(stock_manager).browse(template.id).write({ File "/data/build/odoo/addons/sale_timesheet/models/product_template.py", line 110, in write return super().write(vals) ^^^^^^^^^^^^^^^^^^^ File "/data/build/duong-addons/d_tiktok_shop_connector_patch2/models/product.py", line 56, in write )).write(vals) ^^^^^^^^^^^ File "/data/build/odoo/addons/sale_project/models/product_template.py", line 145, in write return super().write(vals) ^^^^^^^^^^^^^^^^^^^ File "/data/build/duong-addons/d_website_amp_sale/models/product_template.py", line 31, in write res = super().write(vals) ^^^^^^^^^^^^^^^^^^^ File "/data/build/duong-addons/d_tiktok_shop_connector/models/product.py", line 435, in write result = super().write(vals) ^^^^^^^^^^^^^^^^^^^ File "/data/build/odoo/addons/website_sale/models/product_template.py", line 275, in write return super().write(vals) ^^^^^^^^^^^^^^^^^^^ File "/data/build/odoo/addons/rating/models/rating_mixin.py", line 102, in write result = super().write(vals) ^^^^^^^^^^^^^^^^^^^ File "/data/build/odoo/addons/pos_self_order/models/product_product.py", line 75, in write res = super().write(vals) ^^^^^^^^^^^^^^^^^^^ File "/data/build/odoo/addons/point_of_sale/models/product_template.py", line 53, in write return super().write(vals) ^^^^^^^^^^^^^^^^^^^ File "/data/build/odoo/addons/stock_account/models/product.py", line 116, in write res = super().write(vals) ^^^^^^^^^^^^^^^^^^^ File "/data/build/odoo/addons/mrp/models/product.py", line 77, in write return super().write(vals) ^^^^^^^^^^^^^^^^^^^ File "/data/build/odoo/addons/stock/models/product.py", line 1146, in write res = super().write(vals) ^^^^^^^^^^^^^^^^^^^ File "/data/build/odoo/addons/product/models/product_template.py", line 589, in write res = super(ProductTemplate, self).write(vals) ^^^^^^^^^^^^^^^^^^^^^^^^^^^^^^^^^^^^^^^^ File "/data/build/odoo/addons/mail/models/mail_thread.py", line 392, in write result = super().write(vals) ^^^^^^^^^^^^^^^^^^^ File "/data/build/odoo/addons/website/models/mixins.py", line 250, in write return super().write(vals) ^^^^^^^^^^^^^^^^^^^ File "/data/build/odoo/odoo/orm/models.py", line 4384, in write self.check_access('write') File "/data/build/odoo/odoo/orm/models.py", line 4121, in check_access raise result[1]() odoo.exceptions.AccessError: You are not allowed to modify 'Product' (product.template) records. This operation is allowed for the following groups: - Products/Create Contact your administrator to request access if necessary. | |
| 2026-10-10 18:46:47 | WARNING | <function> returns an HTTPException instead of raising it. | |
| 2026-10-10 18:47:04 | WARNING | <function> returns an HTTPException instead of raising it. | |
| 2026-10-10 18:47:14 | WARNING | <function> returns an HTTPException instead of raising it. | |
| 2026-10-10 18:49:21 | ERROR | 0 failed, 1 error(s) of 463 tests when loading database '02116-19-0-all' | |
| 2026-10-10 18:49:45 | INFO | Getting results for build 02116-19-0 | |
| 2026-10-10 18:49:45 | Step test_post_install finished in 10m |