Description: Post install tests for h -> !l
Commit: duong-addons:0e04b6d5  
Subject: [FIX] d_tiktok_shop_connector_patch2: keep the sudo listing maintenance inside the caller's rights and companies
Author: Claude
Commit: odoo:99edb6dd  
Subject: [IMP] account_edi_ubl_cii: Support section in UBL.
Author: Jugurtha
Build time: 29m
Wait time: 2h
Load time: 29m13s
Date (UTC) Level Message
2026-10-10 18:47:39 INFO Init build environment with config duong-addons-run-test
2026-10-10 18:47:39 Starting step restore from config duong-addons-run-test
2026-10-10 18:47:39 Restoring template 02110-19-0-all.zip from build 2110
2026-10-10 18:47:39 Using Dockerfile Tag odoo:Docker19
2026-10-10 18:49:08 INFO Step restore finished in 85s
2026-10-10 18:49:08 Starting step test_post_install from config duong-addons-run-test
2026-10-10 18:49:08 Using Dockerfile Tag odoo:Docker19
2026-10-10 18:49:15 INFO 1 modules loaded in 0.82s, 0 queries (+0 extra)
2026-10-10 18:49:28 INFO 308 modules loaded in 12.32s, 0 queries (+0 extra)
2026-10-10 18:49:30 INFO Pregenerating assets bundles
2026-10-10 19:09:28 ERROR FAILED: [1/19] Tour hr_skills_event_onsite_tour → Step Open Employees app (trigger: .o_app[data-menu-xmlid='hr.menu_hr_root']). Element (.o_app[data-menu-xmlid='hr.menu_hr_root']) has not been found. TIMEOUT step failed to complete within 10000 ms.
2026-10-10 19:09:28 INFO Error received after termination: ---------- FAILED: [1/19] Tour hr_skills_event_onsite_tour → Step Open Employees app (trigger: .o_app[data-menu-xmlid='hr.menu_hr_root']) ---------- { "content": "Open Employees app", "trigger": ".o_app[data-menu-xmlid='hr.menu_hr_root']", "run": "click" }, ---------------------------------------------------------------------------------------------------------------------------------------------------- { "content": "Go to test employee", "trigger": "span:contains('Test Employee')", "run": "click" }, { "content": "Go to Resume Tab", "trigger": "a.nav-link[name='resume']", "run": "click" }, { "content": "Open New Resume Line form", "trigger": "button:contains('Create Resume Lines')", "run": "click" },
2026-10-10 19:09:28 INFO Screenshot
2026-10-10 19:09:29 INFO Chrome Log
2026-10-10 19:09:29 ERROR FAIL: TestOnsite.test_onsite_employee_registration Traceback (most recent call last): File "/data/build/odoo/addons/hr_skills_event/tests/test_onsite.py", line 16, in test_onsite_employee_registration self.start_tour("/odoo", 'hr_skills_event_onsite_tour', login='admin') File "/data/build/odoo/odoo/tests/common.py", line 2597, in start_tour self.browser_js(url_path=url_path, code=code, ready=ready, timeout=timeout, success_signal="tour succeeded", **kwargs) File "/data/build/odoo/odoo/tests/common.py", line 2567, in browser_js self.fail('%s\n\n%s' % (message, error)) AssertionError: The test code "odoo.startTour('hr_skills_event_onsite_tour', {"stepDelay": 0, "keepWatchBrowser": false, "debug": false, "startUrl": "/odoo", "delayToCheckUndeterminisms": 0})" failed FAILED: [1/19] Tour hr_skills_event_onsite_tour → Step Open Employees app (trigger: .o_app[data-menu-xmlid='hr.menu_hr_root']). Element (.o_app[data-menu-xmlid='hr.menu_hr_root']) has not been found. TIMEOUT step failed to complete within 10000 ms.
2026-10-10 19:15:13 INFO [HOOT] Passed 40 tests (260 assertions, total time: 00:00:34)
2026-10-10 19:16:27 ERROR 1 failed, 0 error(s) of 481 tests when loading database '02118-19-0-all'
2026-10-10 19:16:52 INFO Getting results for build 02118-19-0
2026-10-10 19:16:52 Step test_post_install finished in 27m