Description: Post install tests for s ->
Commit: duong-addons:9d735cda  
Subject: [FIX] tests: fix the fixtures exposed by the review fix and by enabling tours
Author: Claude
Commit: odoo:99edb6dd  
Subject: [IMP] account_edi_ubl_cii: Support section in UBL.
Author: Jugurtha
Build time: 74m
Wait time: 74m
Load time: 1h14m
Date (UTC) Level Message
2026-10-11 03:19:33 INFO Init build environment with config duong-addons-run-test
2026-10-11 03:19:33 Starting step restore from config duong-addons-run-test
2026-10-11 03:19:33 Restoring template 02124-19-0-all.zip from build 2124
2026-10-11 03:19:33 Using Dockerfile Tag odoo:Docker19
2026-10-11 03:21:21 INFO Step restore finished in 102s
2026-10-11 03:21:21 Starting step test_post_install from config duong-addons-run-test
2026-10-11 03:21:21 Using Dockerfile Tag odoo:Docker19
2026-10-11 03:21:37 INFO 1 modules loaded in 1.07s, 0 queries (+0 extra)
2026-10-11 03:21:59 INFO 308 modules loaded in 21.72s, 0 queries (+0 extra)
2026-10-11 03:22:03 INFO Pregenerating assets bundles
2026-10-11 04:15:56 INFO [HOOT] Passed 199 tests (976 assertions, total time: 00:00:06)
2026-10-11 04:16:03 INFO QUnit: passed 72 tests (213 assertions), took 3s
2026-10-11 04:17:17 ERROR ERROR: TestWebsiteAssets.test_01_multi_domain_assets_generation Traceback (most recent call last): File "/usr/lib/python3/dist-packages/urllib3/connectionpool.py", line 537, in _make_request response = conn.getresponse() ^^^^^^^^^^^^^^^^^^ File "/usr/lib/python3/dist-packages/urllib3/connection.py", line 461, in getresponse httplib_response = super().getresponse() ^^^^^^^^^^^^^^^^^^^^^ File "/usr/lib/python3.12/http/client.py", line 1448, in getresponse response.begin() File "/usr/lib/python3.12/http/client.py", line 336, in begin version, status, reason = self._read_status() ^^^^^^^^^^^^^^^^^^^ File "/usr/lib/python3.12/http/client.py", line 297, in _read_status line = str(self.fp.readline(_MAXLINE + 1), "iso-8859-1") ^^^^^^^^^^^^^^^^^^^^^^^^^^^^^^ File "/usr/lib/python3.12/socket.py", line 707, in readinto return self._sock.recv_into(b) ^^^^^^^^^^^^^^^^^^^^^^^ TimeoutError: timed out The above exception was the direct cause of the following exception: Traceback (most recent call last): File "/usr/lib/python3/dist-packages/requests/adapters.py", line 486, in send resp = conn.urlopen( ^^^^^^^^^^^^^ File "/usr/lib/python3/dist-packages/urllib3/connectionpool.py", line 845, in urlopen retries = retries.increment( ^^^^^^^^^^^^^^^^^^ File "/usr/lib/python3/dist-packages/urllib3/util/retry.py", line 472, in increment raise reraise(type(error), error, _stacktrace) ^^^^^^^^^^^^^^^^^^^^^^^^^^^^^^^^^^^^^^^^ File "/usr/lib/python3/dist-packages/urllib3/util/util.py", line 39, in reraise raise value File "/usr/lib/python3/dist-packages/urllib3/connectionpool.py", line 791, in urlopen response = self._make_request( ^^^^^^^^^^^^^^^^^^^ File "/usr/lib/python3/dist-packages/urllib3/connectionpool.py", line 539, in _make_request self._raise_timeout(err=e, url=url, timeout_value=read_timeout) File "/usr/lib/python3/dist-packages/urllib3/connectionpool.py", line 371, in _raise_timeout raise ReadTimeoutError( urllib3.exceptions.ReadTimeoutError: HTTPConnectionPool(host='127.0.0.1', port=8069): Read timed out. (read timeout=12) During handling of the above exception, another exception occurred: Traceback (most recent call last): File "/data/build/odoo/addons/website/tests/test_assets.py", line 58, in test_01_multi_domain_assets_generation self.url_open(domain_1 + '/odoo') File "/data/build/odoo/odoo/tests/common.py", line 2342, in url_open return self.opener.request(method, url, params=params, data=data, json=json, files=files, timeout=timeout, headers=headers, cookies=cookies, allow_redirects=allow_redirects) ^^^^^^^^^^^^^^^^^^^^^^^^^^^^^^^^^^^^^^^^^^^^^^^^^^^^^^^^^^^^^^^^^^^^^^^^^^^^^^^^^^^^^^^^^^^^^^^^^^^^^^^^^^^^^^^^^^^^^^^^^^^^^^^^^^^^^^^^^^^^^^^^^^^^^^^^^^^^^^^^^^^^^^ File "/data/build/odoo/odoo/tests/common.py", line 2187, in request return super().request(*args, **kwargs) ^^^^^^^^^^^^^^^^^^^^^^^^^^^^^^^^ File "/usr/lib/python3/dist-packages/requests/sessions.py", line 589, in request resp = self.send(prep, **send_kwargs) ^^^^^^^^^^^^^^^^^^^^^^^^^^^^^^ File "/data/build/odoo/odoo/tests/common.py", line 378, in <lambda> lambda s, r, **kwargs: cls._request_handler(s, r, **kwargs), ^^^^^^^^^^^^^^^^^^^^^^^^^^^^^^^^^^^^ File "/data/build/odoo/odoo/tests/common.py", line 346, in _request_handler return _super_send(s, r, **kw) ^^^^^^^^^^^^^^^^^^^^^^^ File "/usr/lib/python3/dist-packages/requests/sessions.py", line 703, in send r = adapter.send(request, **kwargs) ^^^^^^^^^^^^^^^^^^^^^^^^^^^^^^^ File "/usr/lib/python3/dist-packages/requests/adapters.py", line 532, in send raise ReadTimeout(e, request=request) requests.exceptions.ReadTimeout: HTTPConnectionPool(host='127.0.0.1', port=8069): Read timed out. (read timeout=12)
2026-10-11 04:18:21 INFO public crawled 15 urls in 5.53s 445 queries, 0.369s 29.67q per request,
2026-10-11 04:18:50 INFO demo crawled 98 urls in 29.22s 3645 queries, 0.298s 37.19q per request
2026-10-11 04:33:06 ERROR 0 failed, 1 error(s) of 1280 tests when loading database '02136-19-0-all'
2026-10-11 04:33:33 INFO Getting results for build 02136-19-0
2026-10-11 04:33:33 Step test_post_install finished in 72m