Description: Post install tests for h -> !l
Commit: duong-addons:a626afad  
Subject: [FIX] website controllers: raise request.not_found() instead of returning it
Author: Claude
Committer: Nguyễn Đại Dương
Commit: odoo:99edb6dd  
Subject: [IMP] account_edi_ubl_cii: Support section in UBL.
Author: Jugurtha
Commit: odoo-enteprise:36e91262  
Subject: [MISC] odoo enterprise 19 29/8/2026
Author: daiduongnguyen-odoo
Commit: duong-addons-ee:8d4a63fa  
Subject: [FIX] d_ee_social_douyin, d_ee_social_facebook_messenger: unique field labels
Author: Claude
Build time: 26m
Wait time: 27m
Load time: 26m24s
Date (UTC) Level Message
2026-10-18 06:10:11 INFO Init build environment with config duong-addons-run-test
2026-10-18 06:10:11 Starting step restore from config duong-addons-run-test
2026-10-18 06:10:11 Restoring template 02345-19-0-all.zip from build 2345
2026-10-18 06:10:11 Using Dockerfile Tag odoo:Docker19
2026-10-18 06:11:33 INFO Step restore finished in 80s
2026-10-18 06:11:33 Starting step test_post_install from config duong-addons-run-test
2026-10-18 06:11:33 Using Dockerfile Tag odoo:Docker19
2026-10-18 06:11:40 INFO 1 modules loaded in 0.96s, 0 queries (+0 extra)
2026-10-18 06:11:47 WARNING /data/build/odoo/odoo/osv/__init__.py:4: DeprecationWarning: Since 19.0, odoo.osv is deprecated use odoo.fields.Domain File "/data/build/odoo/odoo-bin", line 6, in <module> odoo.cli.main() File "/data/build/odoo/odoo/cli/command.py", line 133, in main command().run(args) File "/data/build/odoo/odoo/cli/server.py", line 127, in run main(args) File "/data/build/odoo/odoo/cli/server.py", line 118, in main rc = server.start(preload=config['db_name'], stop=stop) File "/data/build/odoo/odoo/service/server.py", line 1677, in start rc = server.run(preload, stop) File "/data/build/odoo/odoo/service/server.py", line 714, in run rc = preload_registries(preload) File "/data/build/odoo/odoo/service/server.py", line 1591, in preload_registries registry = Registry.new(dbname, update_module=update_module, install_modules=config['init'], upgrade_modules=config['update'], reinit_modules=config['reinit']) File "/data/build/odoo/odoo/tools/func.py", line 88, in locked return func(inst, *args, **kwargs) File "/data/build/odoo/odoo/orm/registry.py", line 189, in new load_modules( File "/data/build/odoo/odoo/modules/loading.py", line 464, in load_modules load_module_graph( File "/data/build/odoo/odoo/modules/loading.py", line 178, in load_module_graph load_openerp_module(package.name) File "/data/build/odoo/odoo/modules/module.py", line 506, in load_openerp_module __import__(qualname) File "/data/build/duong-addons-ee/d_ee_social_douyin/__init__.py", line 1, in <module> from . import models File "/data/build/duong-addons-ee/d_ee_social_douyin/models/__init__.py", line 5, in <module> from . import social_post File "/data/build/duong-addons-ee/d_ee_social_douyin/models/social_post.py", line 2, in <module> from odoo.osv import expression File "/data/build/odoo/odoo/osv/__init__.py", line 4, in <module> warnings.warn("Since 19.0, odoo.osv is deprecated use odoo.fields.Domain", DeprecationWarning)
2026-10-18 06:12:03 INFO 476 modules loaded in 22.45s, 0 queries (+2 extra)
2026-10-18 06:12:08 INFO Pregenerating assets bundles
2026-10-18 06:30:19 ERROR ERROR: TestPortalTimesheet.test_collaborators_accessible_by_timesheet_user Traceback (most recent call last): File "/data/build/odoo/addons/hr_timesheet/tests/test_portal_timesheet.py", line 188, in test_collaborators_accessible_by_timesheet_user self.project_portal.with_user(user)._thread_to_store(store, [], request_list=["followers"]) File "/data/build/odoo/addons/project/models/project_project.py", line 1289, in _thread_to_store super()._thread_to_store(store, fields, request_list=request_list) File "/data/build/duong-addons-ee/d_ee_social_tiktok_messaging/models/mail_thread.py", line 9, in _thread_to_store super()._thread_to_store(store, fields, request_list=request_list) File "/data/build/duong-addons/d_social_tiktok_messaging/models/mail_thread.py", line 16, in _thread_to_store channel = Channel._get_tiktok_channel_of_partner(Composer._get_record_partner(thread)) ^^^^^^^^^^^^^^^^^^^^^^^^^^^^ AttributeError: 'tiktok.composer' object has no attribute '_get_record_partner'
2026-10-18 06:35:31 ERROR Test run aborted: Error: Error while loading "@d_social_facebook_messenger/components/messenger_text_variables/messenger_text_variables": Error: Cannot add key "messenger_text_variables" in the "fields" registry: it already exists at ModuleSetLoader.startModule (http://127.0.0.1:8069/web/assets/c0a797c/im_livechat.embed_assets_unit_tests_setup.min.js:41:227) at ModuleSetLoader.startModule (http://127.0.0.1:8069/web/assets/9af077e/im_livechat.embed_assets_unit_tests.min.js:861:60) at ModuleSetLoader.setup (http://127.0.0.1:8069/web/assets/9af077e/im_livechat.embed_assets_unit_tests.min.js:860:34) at describeDrySuite (http://127.0.0.1:8069/web/assets/9af077e/im_livechat.embed_assets_unit_tests.min.js:809:203) at async Runner.dryRun (http://127.0.0.1:8069/web/assets/c0a797c/im_livechat.embed_assets_unit_tests_setup.min.js:1361:15) at async runTests (http://127.0.0.1:8069/web/assets/9af077e/im_livechat.embed_assets_unit_tests.min.js:877:54)
2026-10-18 06:35:31 INFO Screenshot
2026-10-18 06:35:31 INFO Chrome Log
2026-10-18 06:35:31 ERROR FAIL: ExternalTestSuite.test_external_livechat Traceback (most recent call last): File "/data/build/odoo/addons/im_livechat/tests/test_js.py", line 9, in test_external_livechat self.browser_js( File "/data/build/odoo/odoo/tests/common.py", line 2567, in browser_js self.fail('%s\n\n%s' % (message, error)) AssertionError: Some js test failed Test run aborted: Error: Error while loading "@d_social_facebook_messenger/components/messenger_text_variables/messenger_text_variables": Error: Cannot add key "messenger_text_variables" in the "fields" registry: it already exists at ModuleSetLoader.startModule (http://127.0.0.1:8069/web/assets/c0a797c/im_livechat.embed_assets_unit_tests_setup.min.js:41:227) at ModuleSetLoader.startModule (http://127.0.0.1:8069/web/assets/9af077e/im_livechat.embed_assets_unit_tests.min.js:861:60) at ModuleSetLoader.setup (http://127.0.0.1:8069/web/assets/9af077e/im_livechat.embed_assets_unit_tests.min.js:860:34) at describeDrySuite (http://127.0.0.1:8069/web/assets/9af077e/im_livechat.embed_assets_unit_tests.min.js:809:203) at async Runner.dryRun (http://127.0.0.1:8069/web/assets/c0a797c/im_livechat.embed_assets_unit_tests_setup.min.js:1361:15) at async runTests (http://127.0.0.1:8069/web/assets/9af077e/im_livechat.embed_assets_unit_tests.min.js:877:54)
2026-10-18 06:36:10 ERROR 1 failed, 1 error(s) of 626 tests when loading database '02381-19-0-all'
2026-10-18 06:36:35 INFO Getting results for build 02381-19-0
2026-10-18 06:36:35 Step test_post_install finished in 25m