| Date (UTC) | Level | Message | |
|---|---|---|---|
| 2026-10-18 09:30:46 | INFO | Init build environment with config duong-addons-run-test | |
| 2026-10-18 09:30:46 | Starting step restore from config duong-addons-run-test | ||
| 2026-10-18 09:30:46 | Restoring template 02345-19-0-all.zip from build 2345 | ||
| 2026-10-18 09:30:46 | Using Dockerfile Tag odoo:Docker19 | ||
| 2026-10-18 09:32:14 | INFO | Step restore finished in 84s | |
| 2026-10-18 09:32:14 | Starting step test_post_install from config duong-addons-run-test | ||
| 2026-10-18 09:32:14 | Using Dockerfile Tag odoo:Docker19 | ||
| 2026-10-18 09:32:26 | INFO | 1 modules loaded in 1.01s, 0 queries (+0 extra) | |
| 2026-10-18 09:32:34 | WARNING | /data/build/odoo/odoo/osv/__init__.py:4: DeprecationWarning: Since 19.0, odoo.osv is deprecated use odoo.fields.Domain File "/data/build/odoo/odoo-bin", line 6, in <module> odoo.cli.main() File "/data/build/odoo/odoo/cli/command.py", line 133, in main command().run(args) File "/data/build/odoo/odoo/cli/server.py", line 127, in run main(args) File "/data/build/odoo/odoo/cli/server.py", line 118, in main rc = server.start(preload=config['db_name'], stop=stop) File "/data/build/odoo/odoo/service/server.py", line 1677, in start rc = server.run(preload, stop) File "/data/build/odoo/odoo/service/server.py", line 714, in run rc = preload_registries(preload) File "/data/build/odoo/odoo/service/server.py", line 1591, in preload_registries registry = Registry.new(dbname, update_module=update_module, install_modules=config['init'], upgrade_modules=config['update'], reinit_modules=config['reinit']) File "/data/build/odoo/odoo/tools/func.py", line 88, in locked return func(inst, *args, **kwargs) File "/data/build/odoo/odoo/orm/registry.py", line 189, in new load_modules( File "/data/build/odoo/odoo/modules/loading.py", line 464, in load_modules load_module_graph( File "/data/build/odoo/odoo/modules/loading.py", line 178, in load_module_graph load_openerp_module(package.name) File "/data/build/odoo/odoo/modules/module.py", line 506, in load_openerp_module __import__(qualname) File "/data/build/duong-addons-ee/d_ee_social_douyin/__init__.py", line 1, in <module> from . import models File "/data/build/duong-addons-ee/d_ee_social_douyin/models/__init__.py", line 5, in <module> from . import social_post File "/data/build/duong-addons-ee/d_ee_social_douyin/models/social_post.py", line 2, in <module> from odoo.osv import expression File "/data/build/odoo/odoo/osv/__init__.py", line 4, in <module> warnings.warn("Since 19.0, odoo.osv is deprecated use odoo.fields.Domain", DeprecationWarning) | |
| 2026-10-18 09:32:50 | INFO | 476 modules loaded in 23.32s, 0 queries (+2 extra) | |
| 2026-10-18 09:32:54 | INFO | Pregenerating assets bundles | |
| 2026-10-18 10:21:57 | ERROR | Error received after termination: The following modules failed to load because of an error: ['@d_social_facebook_messenger/components/messenger_text_variables/messenger_text_variables'] | |
| 2026-10-18 10:21:57 | ERROR | Error received after termination: The following modules failed to load because of an error: ['@d_social_facebook_messenger/components/messenger_text_variables/messenger_text_variables'] | |
| 2026-10-18 10:21:57 | ERROR | Error received after termination: The following modules are needed by other modules but have not been defined, they may not be present in the correct asset bundle: ['@web_tour/tour_service/tour_utils'] | |
| 2026-10-18 10:21:57 | ERROR | Error received after termination: The following modules could not be loaded because they have unmet dependencies, this is a secondary error which is likely caused by one of the above problems: ['@d_ee_bank_connector_sepay/../tests/tours/sepay_connect_tour'] | |
| 2026-10-18 10:21:57 | INFO | Screenshot | |
| 2026-10-18 10:22:56 | INFO | Chrome Log | |
| 2026-10-18 10:22:56 | ERROR | ERROR: TestMenusAdminLight.test_01_click_apps_menus_as_admin Traceback (most recent call last): File "/data/build/odoo/addons/web/tests/test_click_everywhere.py", line 86, in test_01_click_apps_menus_as_admin self.browser_js("/odoo", "odoo.loader.modules.get('@web/webclient/clickbot/clickbot_loader').startClickEverywhere(undefined, true);", "odoo.isReady === true", login="admin", timeout=120, success_signal="clickbot test succeeded") File "/data/build/odoo/odoo/tests/common.py", line 2555, in browser_js self.assertTrue(browser._wait_ready(ready), 'The ready "%s" code was always falsy' % ready) ^^^^^^^^^^^^^^^^^^^^^^^^^^ File "/data/build/odoo/odoo/tests/common.py", line 1901, in _wait_ready raise exc from None odoo.tests.common.ChromeBrowserException: UncaughtError: Error while loading "@d_social_facebook_messenger/components/messenger_text_variables/messenger_text_variables": Error: Cannot add key "messenger_text_variables" in the "fields" registry: it already exists at ModuleLoader.startModule (http://127.0.0.1:8069/web/assets/73cb185/web.assets_web.min.js:41:227) at ModuleLoader.startModules (http://127.0.0.1:8069/web/assets/73cb185/web.assets_web.min.js:40:57) at ModuleLoader.addJob (http://127.0.0.1:8069/web/assets/73cb185/web.assets_web.min.js:5:39) at ModuleLoader.define (http://127.0.0.1:8069/web/assets/73cb185/web.assets_web.min.js:10:121) at http://127.0.0.1:8069/web/assets/73cb185/web.assets_web.min.js:32434:6 at startModule (http://127.0.0.1:8069/web/assets/73cb185/web.assets_web.min.js:40:226) at startModules (http://127.0.0.1:8069/web/assets/73cb185/web.assets_web.min.js:39:56) at addJob (http://127.0.0.1:8069/web/assets/73cb185/web.assets_web.min.js:4:38) at define (http://127.0.0.1:8069/web/assets/73cb185/web.assets_web.min.js:9:120) at (http://127.0.0.1:8069/web/assets/73cb185/web.assets_web.min.js:32433:5) | |
| 2026-10-18 10:23:03 | ERROR | Error received after termination: The following modules failed to load because of an error: ['@d_social_facebook_messenger/components/messenger_text_variables/messenger_text_variables'] | |
| 2026-10-18 10:23:03 | ERROR | Error received after termination: The following modules failed to load because of an error: ['@d_social_facebook_messenger/components/messenger_text_variables/messenger_text_variables'] | |
| 2026-10-18 10:23:03 | ERROR | Error received after termination: The following modules are needed by other modules but have not been defined, they may not be present in the correct asset bundle: ['@web_tour/tour_service/tour_utils'] | |
| 2026-10-18 10:23:03 | ERROR | Error received after termination: The following modules could not be loaded because they have unmet dependencies, this is a secondary error which is likely caused by one of the above problems: ['@d_ee_bank_connector_sepay/../tests/tours/sepay_connect_tour'] | |
| 2026-10-18 10:23:03 | INFO | Screenshot | |
| 2026-10-18 10:24:01 | INFO | Chrome Log | |
| 2026-10-18 10:24:01 | ERROR | ERROR: TestMenusDemoLight.test_01_click_apps_menus_as_demo Traceback (most recent call last): File "/data/build/odoo/odoo/tests/common.py", line 1676, in _websocket_request return f.result(timeout=timeout * self.throttling_factor) ^^^^^^^^^^^^^^^^^^^^^^^^^^^^^^^^^^^^^^^^^^^^^^^^^^ File "/usr/lib/python3.12/concurrent/futures/_base.py", line 458, in result raise TimeoutError() TimeoutError During handling of the above exception, another exception occurred: Traceback (most recent call last): File "/data/build/odoo/addons/web/tests/test_click_everywhere.py", line 111, in test_01_click_apps_menus_as_demo self.browser_js("/odoo", "odoo.loader.modules.get('@web/webclient/clickbot/clickbot_loader').startClickEverywhere(undefined, true);", "odoo.isReady === true", login="demo", timeout=120, success_signal="clickbot test succeeded") File "/data/build/odoo/odoo/tests/common.py", line 2555, in browser_js self.assertTrue(browser._wait_ready(ready), 'The ready "%s" code was always falsy' % ready) ^^^^^^^^^^^^^^^^^^^^^^^^^^ File "/data/build/odoo/odoo/tests/common.py", line 1883, in _wait_ready result = self._websocket_request('Runtime.evaluate', params={ ^^^^^^^^^^^^^^^^^^^^^^^^^^^^^^^^^^^^^^^^^^^^^^^^^^^^ File "/data/build/odoo/odoo/tests/common.py", line 1678, in _websocket_request raise TimeoutError(f'{method}({params or ""})') TimeoutError: Runtime.evaluate({'expression': 'try { odoo.isReady === true } catch {}', 'awaitPromise': True}) | |
| 2026-10-18 10:24:23 | INFO | [HOOT] Passed 199 tests (976 assertions, total time: 00:00:05) | |
| 2026-10-18 10:24:27 | ERROR | Error received after termination: The following modules failed to load because of an error: ['@d_social_facebook_messenger/components/messenger_text_variables/messenger_text_variables'] | |
| 2026-10-18 10:24:27 | ERROR | Exception received after termination: UncaughtError: Error while loading "@web/../tests/legacy/legacy_tests/core/class_tests": ReferenceError: QUnit is not defined at ModuleLoader.startModule (http://127.0.0.1:8069/web/assets/b1a1434/web.tests_assets.min.js:41:227) at ModuleLoader.startModules (http://127.0.0.1:8069/web/assets/b1a1434/web.tests_assets.min.js:40:57) at ModuleLoader.addJob (http://127.0.0.1:8069/web/assets/b1a1434/web.tests_assets.min.js:5:39) at ModuleLoader.define (http://127.0.0.1:8069/web/assets/b1a1434/web.tests_assets.min.js:10:121) at http://127.0.0.1:8069/web/assets/9bbc69c/web.qunit_suite_tests.min.js:159:6 at startModule (http://127.0.0.1:8069/web/assets/b1a1434/web.tests_assets.min.js:40:226) at startModules (http://127.0.0.1:8069/web/assets/b1a1434/web.tests_assets.min.js:39:56) at addJob (http://127.0.0.1:8069/web/assets/b1a1434/web.tests_assets.min.js:4:38) at define (http://127.0.0.1:8069/web/assets/b1a1434/web.tests_assets.min.js:9:120) at (http://127.0.0.1:8069/web/assets/9bbc69c/web.qunit_suite_tests.min.js:158:5) | |
| 2026-10-18 10:24:27 | ERROR | Error received after termination: The following modules failed to load because of an error: ['@d_social_facebook_messenger/components/messenger_text_variables/messenger_text_variables', '@web/../tests/legacy/legacy_tests/core/class_tests'] | |
| 2026-10-18 10:24:27 | ERROR | Error received after termination: The following modules are needed by other modules but have not been defined, they may not be present in the correct asset bundle: ['@web/../tests/helpers/utils', '@web/../tests/legacy/helpers/utils', '@web/../tests/helpers/mock_services', '@web/../tests/helpers/cleanup', '@web/../tests/legacy_tests/helpers/test_utils'] | |
| 2026-10-18 10:24:27 | ERROR | Error received after termination: The following modules could not be loaded because they have unmet dependencies, this is a secondary error which is likely caused by one of the above problems: ['@web/../tests/legacy/core/datetime/datetime_test_helpers', '@web/../tests/core/datetime/datetime_test_helpers', '@web/../tests/legacy/core/utils/nested_sortable_tests', '@web/../tests/core/utils/nested_sortable_tests', '@web/../tests/legacy/views/graph_view_tests', '@web/../tests/views/graph_view_tests', '@web/../tests/legacy/views/kanban/helpers', '@web/../tests/views/kanban/helpers', '@web/../tests/legacy/public/minimal_dom', '@web/../tests/legacy/public/public_widget_tests'] | |
| 2026-10-18 10:24:27 | INFO | Screenshot | |
| 2026-10-18 10:24:28 | INFO | Chrome Log | |
| 2026-10-18 10:24:28 | ERROR | FAIL: WebSuite.test_qunit_desktop Traceback (most recent call last): File "/data/build/odoo/addons/web/tests/test_js.py", line 201, in test_qunit_desktop self.browser_js(f'/web/tests/legacy?mod=web{self.qunit_filters}', "", "", login='admin', timeout=1800, success_signal="QUnit test suite done.", error_checker=qunit_error_checker) File "/data/build/odoo/odoo/tests/common.py", line 2567, in browser_js self.fail('%s\n\n%s' % (message, error)) AssertionError: Some js test failed UncaughtError: Error while loading "@d_social_facebook_messenger/components/messenger_text_variables/messenger_text_variables": Error: Cannot add key "messenger_text_variables" in the "fields" registry: it already exists at ModuleLoader.startModule (http://127.0.0.1:8069/web/assets/b1a1434/web.tests_assets.min.js:41:227) at ModuleLoader.startModules (http://127.0.0.1:8069/web/assets/b1a1434/web.tests_assets.min.js:40:57) at ModuleLoader.addJob (http://127.0.0.1:8069/web/assets/b1a1434/web.tests_assets.min.js:5:39) at ModuleLoader.define (http://127.0.0.1:8069/web/assets/b1a1434/web.tests_assets.min.js:10:121) at http://127.0.0.1:8069/web/assets/b1a1434/web.tests_assets.min.js:32434:6 at startModule (http://127.0.0.1:8069/web/assets/b1a1434/web.tests_assets.min.js:40:226) at startModules (http://127.0.0.1:8069/web/assets/b1a1434/web.tests_assets.min.js:39:56) at addJob (http://127.0.0.1:8069/web/assets/b1a1434/web.tests_assets.min.js:4:38) at define (http://127.0.0.1:8069/web/assets/b1a1434/web.tests_assets.min.js:9:120) at (http://127.0.0.1:8069/web/assets/b1a1434/web.tests_assets.min.js:32433:5) | |
| 2026-10-18 10:25:15 | ERROR | Error received after termination: The following modules failed to load because of an error: ['@d_social_facebook_messenger/components/messenger_text_variables/messenger_text_variables'] | |
| 2026-10-18 10:25:15 | INFO | Screenshot | |
| 2026-10-18 10:25:16 | ERROR | Error received after termination: The following modules failed to load because of an error: ['@d_social_facebook_messenger/components/messenger_text_variables/messenger_text_variables'] | |
| 2026-10-18 10:25:16 | ERROR | Error received after termination: The following modules are needed by other modules but have not been defined, they may not be present in the correct asset bundle: ['@web_tour/tour_service/tour_utils'] | |
| 2026-10-18 10:25:16 | ERROR | Error received after termination: The following modules could not be loaded because they have unmet dependencies, this is a secondary error which is likely caused by one of the above problems: ['@d_ee_bank_connector_sepay/../tests/tours/sepay_connect_tour'] | |
| 2026-10-18 10:25:16 | ERROR | Error received after termination: The following modules failed to load because of an error: ['@d_social_facebook_messenger/components/messenger_text_variables/messenger_text_variables'] | |
| 2026-10-18 10:25:16 | ERROR | Error received after termination: The following modules are needed by other modules but have not been defined, they may not be present in the correct asset bundle: ['@web_tour/tour_service/tour_utils'] | |
| 2026-10-18 10:25:16 | ERROR | Error received after termination: The following modules could not be loaded because they have unmet dependencies, this is a secondary error which is likely caused by one of the above problems: ['@d_ee_bank_connector_sepay/../tests/tours/sepay_connect_tour'] | |
| 2026-10-18 10:25:16 | INFO | Chrome Log | |
| 2026-10-18 10:25:16 | ERROR | FAIL: WebTourHttp.test_sanity_automatic Traceback (most recent call last): File "/data/build/odoo/addons/web_tour/tests/test_tours.py", line 132, in test_sanity_automatic self.browser_js("/odoo?debug=tests", code, ready=ready, login="admin") File "/data/build/odoo/odoo/tests/common.py", line 2567, in browser_js self.fail('%s\n\n%s' % (message, error)) AssertionError: The test code " odoo.define("@web_tour/../tests/sanity_test", [], () => { const errors = []; for (const module of ["@odoo/hoot-dom", "@web_tour/js/tour_step"]) { if (odoo.loader.modules.get(module)) { errors.push(module) } } if (!errors.length) { console.log("test successful"); } else { console.error(`Modules "${errors.join(", ")}" should not be available at this point`) } }) " failed UncaughtError: Error while loading "@d_social_facebook_messenger/components/messenger_text_variables/messenger_text_variables": Error: Cannot add key "messenger_text_variables" in the "fields" registry: it already exists at ModuleLoader.startModule (http://127.0.0.1:8069/web/assets/73cb185/web.assets_web.min.js:41:227) at ModuleLoader.startModules (http://127.0.0.1:8069/web/assets/73cb185/web.assets_web.min.js:40:57) at ModuleLoader.addJob (http://127.0.0.1:8069/web/assets/73cb185/web.assets_web.min.js:5:39) at ModuleLoader.define (http://127.0.0.1:8069/web/assets/73cb185/web.assets_web.min.js:10:121) at http://127.0.0.1:8069/web/assets/73cb185/web.assets_web.min.js:32434:6 at startModule (http://127.0.0.1:8069/web/assets/73cb185/web.assets_web.min.js:40:226) at startModules (http://127.0.0.1:8069/web/assets/73cb185/web.assets_web.min.js:39:56) at addJob (http://127.0.0.1:8069/web/assets/73cb185/web.assets_web.min.js:4:38) at define (http://127.0.0.1:8069/web/assets/73cb185/web.assets_web.min.js:9:120) at (http://127.0.0.1:8069/web/assets/73cb185/web.assets_web.min.js:32433:5) | |
| 2026-10-18 10:25:20 | ERROR | Error received after termination: The following modules failed to load because of an error: ['@d_social_facebook_messenger/components/messenger_text_variables/messenger_text_variables'] | |
| 2026-10-18 10:25:21 | INFO | Screenshot | |
| 2026-10-18 10:25:21 | ERROR | Error received after termination: The following modules failed to load because of an error: ['@d_social_facebook_messenger/components/messenger_text_variables/messenger_text_variables'] | |
| 2026-10-18 10:25:21 | INFO | Chrome Log | |
| 2026-10-18 10:25:21 | ERROR | FAIL: WebTourHttp.test_sanity_onboarding Traceback (most recent call last): File "/data/build/odoo/addons/web_tour/tests/test_tours.py", line 175, in test_sanity_onboarding self.browser_js("/odoo?debug=0", code, ready=ready, login="admin") File "/data/build/odoo/odoo/tests/common.py", line 2567, in browser_js self.fail('%s\n\n%s' % (message, error)) AssertionError: The test code " odoo.define("@web_tour/../tests/sanity_test", [], () => { const errors = []; for (const module of ["@odoo/hoot-dom", "@web_tour/js/tour_step"]) { if (odoo.loader.modules.get(module)) { errors.push(module) } } if (!errors.length) { console.log("test successful"); } else { console.error(`Modules "${errors.join(", ")}" should not be available at this point`) } }) " failed UncaughtError: Error while loading "@d_social_facebook_messenger/components/messenger_text_variables/messenger_text_variables": Error: Cannot add key "messenger_text_variables" in the "fields" registry: it already exists at ModuleLoader.startModule (http://127.0.0.1:8069/web/assets/73cb185/web.assets_web.min.js:41:227) at ModuleLoader.startModules (http://127.0.0.1:8069/web/assets/73cb185/web.assets_web.min.js:40:57) at ModuleLoader.addJob (http://127.0.0.1:8069/web/assets/73cb185/web.assets_web.min.js:5:39) at ModuleLoader.define (http://127.0.0.1:8069/web/assets/73cb185/web.assets_web.min.js:10:121) at http://127.0.0.1:8069/web/assets/73cb185/web.assets_web.min.js:32434:6 at startModule (http://127.0.0.1:8069/web/assets/73cb185/web.assets_web.min.js:40:226) at startModules (http://127.0.0.1:8069/web/assets/73cb185/web.assets_web.min.js:39:56) at addJob (http://127.0.0.1:8069/web/assets/73cb185/web.assets_web.min.js:4:38) at define (http://127.0.0.1:8069/web/assets/73cb185/web.assets_web.min.js:9:120) at (http://127.0.0.1:8069/web/assets/73cb185/web.assets_web.min.js:32433:5) | |
| 2026-10-18 10:26:05 | INFO | public crawled 15 urls in 5.00s 445 queries, 0.333s 29.67q per request, | |
| 2026-10-18 10:26:25 | INFO | demo crawled 97 urls in 19.60s 3550 queries, 0.202s 36.60q per request | |
| 2026-10-18 10:38:51 | ERROR | 3 failed, 2 error(s) of 1349 tests when loading database '02384-19-0-all' | |
| 2026-10-18 10:39:15 | INFO | Getting results for build 02384-19-0 | |
| 2026-10-18 10:39:15 | Step test_post_install finished in 67m |