Description: Test pylint
Commit: duong-addons:77b87be4  
Subject: [FIX] d_social_content_tank*, d_crm_meta_lead_ads: Odoo 19 view and pylint checks
Author: daiduongnguyen-odoo
Commit: odoo:99edb6dd  
Subject: [IMP] account_edi_ubl_cii: Support section in UBL.
Author: Jugurtha
Commit: odoo-enteprise:36e91262  
Subject: [MISC] odoo enterprise 19 29/8/2026
Author: daiduongnguyen-odoo
Commit: duong-addons-ee:7c580bbb  
Subject: [DOC] TikTok Messaging: distinguish optional Business IAP setup from required messaging credentials
Author: Nguyễn Đại Dương
Build time: 85m
Wait time: 5h
Load time: 1h25m
Date (UTC) Level Message
2026-10-18 13:09:53 INFO Init build environment with config duong-addons-run-test
2026-10-18 13:09:53 Starting step test_pylint from config duong-addons-run-test
2026-10-18 13:09:53 Using Dockerfile Tag odoo:Docker19
2026-10-18 13:10:29 INFO 1 modules loaded in 18.66s, 8375 queries (+8375 extra)
2026-10-18 13:11:10 ERROR FAIL: Subtest ManifestLinter.test_manifests (module='d_ee_social_dashboard_douyin') Traceback (most recent call last): File "/data/build/odoo/odoo/addons/test_lint/tests/test_manifests.py", line 32, in test_manifests self._test_manifest_values(manifest) File "/data/build/odoo/odoo/addons/test_lint/tests/test_manifests.py", line 56, in _test_manifest_values self.assertNotEqual( AssertionError: [] == [] : Setting manifest key data to the default manifest value for module 'd_ee_social_dashboard_douyin'. You can remove this key from the dict to reduce noise/inconsistencies between manifests specifications and ease understanding of manifest content.
2026-10-18 13:11:10 ERROR FAIL: Subtest ManifestLinter.test_manifests (module='d_ee_social_facebook_messenger_account') Traceback (most recent call last): File "/data/build/odoo/odoo/addons/test_lint/tests/test_manifests.py", line 32, in test_manifests self._test_manifest_values(manifest) File "/data/build/odoo/odoo/addons/test_lint/tests/test_manifests.py", line 56, in _test_manifest_values self.assertNotEqual( AssertionError: False == False : Setting manifest key application to the default manifest value for module 'd_ee_social_facebook_messenger_account'. You can remove this key from the dict to reduce noise/inconsistencies between manifests specifications and ease understanding of manifest content.
2026-10-18 13:11:10 ERROR FAIL: Subtest ManifestLinter.test_manifests (module='d_ee_social_facebook_messenger_crm') Traceback (most recent call last): File "/data/build/odoo/odoo/addons/test_lint/tests/test_manifests.py", line 32, in test_manifests self._test_manifest_values(manifest) File "/data/build/odoo/odoo/addons/test_lint/tests/test_manifests.py", line 56, in _test_manifest_values self.assertNotEqual( AssertionError: False == False : Setting manifest key application to the default manifest value for module 'd_ee_social_facebook_messenger_crm'. You can remove this key from the dict to reduce noise/inconsistencies between manifests specifications and ease understanding of manifest content.
2026-10-18 13:11:10 ERROR FAIL: Subtest ManifestLinter.test_manifests (module='d_ee_social_facebook_messenger_event') Traceback (most recent call last): File "/data/build/odoo/odoo/addons/test_lint/tests/test_manifests.py", line 32, in test_manifests self._test_manifest_values(manifest) File "/data/build/odoo/odoo/addons/test_lint/tests/test_manifests.py", line 56, in _test_manifest_values self.assertNotEqual( AssertionError: False == False : Setting manifest key application to the default manifest value for module 'd_ee_social_facebook_messenger_event'. You can remove this key from the dict to reduce noise/inconsistencies between manifests specifications and ease understanding of manifest content.
2026-10-18 13:12:13 INFO pylint version: 3.0.3
2026-10-18 14:34:44 ERROR FAIL: TestPyLint.test_pylint Traceback (most recent call last): File "/data/build/odoo/odoo/addons/test_lint/tests/test_pylint.py", line 109, in test_pylint self.fail(f"pylint test failed:\n\n{r.stdout}\n{r.stderr}".strip()) AssertionError: pylint test failed: ************* Module d_ee_social_tiktok_business.models.social_account Usage of _, _lt function with multiple unnamed placeholders (E8505) at duong-addons-ee/d_ee_social_tiktok_business/models/social_account.py:550 Usage of _, _lt function with multiple unnamed placeholders (E8505) at duong-addons-ee/d_ee_social_tiktok_business/models/social_account.py:556 ************* Module d_ee_social_tiktok_messaging.models.tiktok_auto_message Raise inside unlink override. (E8503) at duong-addons-ee/d_ee_social_tiktok_messaging/models/tiktok_auto_message.py:198 ************* Module d_ee_social_tiktok_messaging.models.tiktok_messaging_api Usage of _, _lt function with multiple unnamed placeholders (E8505) at duong-addons-ee/d_ee_social_tiktok_messaging/models/tiktok_messaging_api.py:54 Usage of _, _lt function with multiple unnamed placeholders (E8505) at duong-addons-ee/d_ee_social_tiktok_messaging/models/tiktok_messaging_api.py:56 Usage of _, _lt function with multiple unnamed placeholders (E8505) at duong-addons-ee/d_ee_social_tiktok_messaging/models/tiktok_messaging_api.py:58 ************* Module d_ee_social_messenger_base.models.messenger_base_template_variable Static string passed to ValidationError without gettext call. (E8507) at duong-addons-ee/d_ee_social_messenger_base/models/messenger_base_template_variable.py:55 ************* Module d_ee_social_messenger_base.models.messenger_base_api Usage of _, _lt function with multiple unnamed placeholders (E8505) at duong-addons-ee/d_ee_social_messenger_base/models/messenger_base_api.py:41 Usage of _, _lt function with multiple unnamed placeholders (E8505) at duong-addons-ee/d_ee_social_messenger_base/models/messenger_base_api.py:53 Usage of _, _lt function with multiple unnamed placeholders (E8505) at duong-addons-ee/d_ee_social_messenger_base/models/messenger_base_api.py:66 Usage of _, _lt function with multiple unnamed placeholders (E8505) at duong-addons-ee/d_ee_social_messenger_base/models/messenger_base_api.py:79 Usage of _, _lt function with multiple unnamed placeholders (E8505) at duong-addons-ee/d_ee_social_messenger_base/models/messenger_base_api.py:92 Usage of _, _lt function with multiple unnamed placeholders (E8505) at duong-addons-ee/d_ee_social_messenger_base/models/messenger_base_api.py:107 ************* Module d_ee_social_douyin.models.social_live_post Usage of _, _lt function with multiple unnamed placeholders (E8505) at duong-addons-ee/d_ee_social_douyin/models/social_live_post.py:189 ************* Module d_ee_social_facebook_messenger.models.messenger_template_button Static string passed to ValidationError without gettext call. (E8507) at duong-addons-ee/d_ee_social_facebook_messenger/models/messenger_template_button.py:42 Static string passed to ValidationError without gettext call. (E8507) at duong-addons-ee/d_ee_social_facebook_messenger/models/messenger_template_button.py:44 Static string passed to ValidationError without gettext call. (E8507) at duong-addons-ee/d_ee_social_facebook_messenger/models/messenger_template_button.py:46 Static string passed to ValidationError without gettext call. (E8507) at duong-addons-ee/d_ee_social_facebook_messenger/models/messenger_template_button.py:48 ************* Module d_ee_social_facebook_messenger.models.messenger_template_element Static string passed to ValidationError without gettext call. (E8507) at duong-addons-ee/d_ee_social_facebook_messenger/models/messenger_template_element.py:50 Static string passed to ValidationError without gettext call. (E8507) at duong-addons-ee/d_ee_social_facebook_messenger/models/messenger_template_element.py:56 ************* Module d_ee_social_facebook_messenger.models.facebook_messenger_api Static string passed to UserError without gettext call. (E8507) at duong-addons-ee/d_ee_social_facebook_messenger/models/facebook_messenger_api.py:137 Static string passed to UserError without gettext call. (E8507) at duong-addons-ee/d_ee_social_facebook_messenger/models/facebook_messenger_api.py:154 Static string passed to UserError without gettext call. (E8507) at duong-addons-ee/d_ee_social_facebook_messenger/models/facebook_messenger_api.py:172 ************* Module d_ee_social_facebook_messenger.models.messenger_meta_template_variable Static string passed to ValidationError without gettext call. (E8507) at duong-addons-ee/d_ee_social_facebook_messenger/models/messenger_meta_template_variable.py:32 Static string passed to ValidationError without gettext call. (E8507) at duong-addons-ee/d_ee_social_facebook_messenger/models/messenger_meta_template_variable.py:54 ------------------------------------ Your code has been rated at 10.00/10 <unknown>:736: SyntaxWarning: invalid escape sequence '\-' <unknown>:1219: SyntaxWarning: invalid escape sequence '\;' <unknown>:1219: SyntaxWarning: invalid escape sequence '\,'
2026-10-18 14:34:53 ERROR Module test_lint: 5 failures, 0 errors of 24 tests
2026-10-18 14:35:12 INFO 23 modules loaded in 5077.40s, 8951 queries (+9009 extra)
2026-10-18 14:35:13 ERROR At least one test failed when loading the modules.
2026-10-18 14:35:13 ERROR 5 failed, 0 error(s) of 24 tests when loading database '02388-19-0-all'
2026-10-18 14:35:21 INFO Getting results for build 02388-19-0
2026-10-18 14:35:21 Step test_pylint finished in 85m