Description: Post install tests for m -> !s
Commit: duong-addons:2845ef05  
Subject: 1
Author: daiduongnguyen-odoo
Commit: odoo:99edb6dd  
Subject: [IMP] account_edi_ubl_cii: Support section in UBL.
Author: Jugurtha
Commit: odoo-enteprise:36e91262  
Subject: [MISC] odoo enterprise 19 29/8/2026
Author: daiduongnguyen-odoo
Commit: duong-addons-ee:08826365  
Subject: [IMP] Standardize enterprise author and website metadata
Author: Nguyễn Đại Dương
Build time: 7m
Wait time: 85m
Load time: 7m10s
Date (UTC) Level Message
2026-10-20 15:49:52 INFO Init build environment with config duong-addons-run-test
2026-10-20 15:49:52 Starting step restore from config duong-addons-run-test
2026-10-20 15:49:52 Restoring template 02480-19-0-all.zip from build 2480
2026-10-20 15:49:52 Using Dockerfile Tag odoo:Docker19
2026-10-20 15:50:28 INFO Step restore finished in 35s
2026-10-20 15:50:28 Starting step test_post_install from config duong-addons-run-test
2026-10-20 15:50:28 Using Dockerfile Tag odoo:Docker19
2026-10-20 15:50:35 INFO 1 modules loaded in 0.82s, 0 queries (+0 extra)
2026-10-20 15:50:41 INFO 122 modules loaded in 5.94s, 0 queries (+0 extra)
2026-10-20 15:50:42 INFO Pregenerating assets bundles
2026-10-20 15:55:58 ERROR FAIL: TestPaymentTransaction.test_capture_allowed_for_authorized_users Traceback (most recent call last): File "/data/build/odoo/addons/payment/tests/common.py", line 230, in _assert_does_not_raise func(*args, **kwargs) File "/data/build/odoo/addons/payment/models/payment_transaction.py", line 273, in action_capture payment_utils.check_rights_on_recordset(self) odoo.exceptions.AccessError: You are not allowed to modify 'Payment Transaction' (payment.transaction) records. This operation is allowed for the following groups: - Role / Administrator Contact your administrator to request access if necessary. During handling of the above exception, another exception occurred: Traceback (most recent call last): File "/data/build/odoo/addons/payment/tests/test_payment_transaction.py", line 32, in test_capture_allowed_for_authorized_users self._assert_does_not_raise(AccessError, tx.with_user(user).action_capture) File "/data/build/odoo/addons/payment/tests/common.py", line 232, in _assert_does_not_raise self.fail(f"{func.__name__} should not raise error of class {exception_class.__name__}") AssertionError: action_capture should not raise error of class AccessError
2026-10-20 15:55:58 ERROR FAIL: TestPaymentTransaction.test_refund_allowed_for_authorized_users Traceback (most recent call last): File "/data/build/odoo/addons/payment/tests/common.py", line 230, in _assert_does_not_raise func(*args, **kwargs) File "/data/build/odoo/addons/payment/models/payment_transaction.py", line 319, in action_refund payment_utils.check_rights_on_recordset(self) odoo.exceptions.AccessError: You are not allowed to modify 'Payment Transaction' (payment.transaction) records. This operation is allowed for the following groups: - Role / Administrator Contact your administrator to request access if necessary. During handling of the above exception, another exception occurred: Traceback (most recent call last): File "/data/build/odoo/addons/payment/tests/test_payment_transaction.py", line 50, in test_refund_allowed_for_authorized_users self._assert_does_not_raise(AccessError, tx.with_user(user).action_refund) File "/data/build/odoo/addons/payment/tests/common.py", line 232, in _assert_does_not_raise self.fail(f"{func.__name__} should not raise error of class {exception_class.__name__}") AssertionError: action_refund should not raise error of class AccessError
2026-10-20 15:55:58 ERROR FAIL: TestPaymentTransaction.test_void_allowed_for_authorized_users Traceback (most recent call last): File "/data/build/odoo/addons/payment/tests/common.py", line 230, in _assert_does_not_raise func(*args, **kwargs) File "/data/build/odoo/addons/payment/models/payment_transaction.py", line 298, in action_void payment_utils.check_rights_on_recordset(self) odoo.exceptions.AccessError: You are not allowed to modify 'Payment Transaction' (payment.transaction) records. This operation is allowed for the following groups: - Role / Administrator Contact your administrator to request access if necessary. During handling of the above exception, another exception occurred: Traceback (most recent call last): File "/data/build/odoo/addons/payment/tests/test_payment_transaction.py", line 41, in test_void_allowed_for_authorized_users self._assert_does_not_raise(AccessError, tx.with_user(user).action_void) File "/data/build/odoo/addons/payment/tests/common.py", line 232, in _assert_does_not_raise self.fail(f"{func.__name__} should not raise error of class {exception_class.__name__}") AssertionError: action_void should not raise error of class AccessError
2026-10-20 15:56:53 ERROR 3 failed, 0 error(s) of 465 tests when loading database '02492-19-0-all'
2026-10-20 15:57:02 INFO Getting results for build 02492-19-0
2026-10-20 15:57:02 Step test_post_install finished in 6m