Description: Post install tests for h -> !l
Commit: duong-addons:70f2bf53  
Subject: [FIX] d_pos_adyen_tap_to_pay: align the archived installation test with re-boarding
Author: Claude
Commit: odoo:99edb6dd  
Subject: [IMP] account_edi_ubl_cii: Support section in UBL.
Author: Jugurtha
Build time: 25m
Wait time: 116m
Load time: 25m16s
Date (UTC) Level Message
2026-10-01 17:23:33 INFO Init build environment with config duong-addons-run-test
2026-10-01 17:23:33 Starting step restore from config duong-addons-run-test
2026-10-01 17:23:33 Restoring dump 01284-19-0-all.zip from build 1284
2026-10-01 17:23:33 Using Dockerfile Tag odoo:Docker19
2026-10-01 17:25:10 INFO Step restore finished in 97s
2026-10-01 17:25:10 Starting step test_post_install from config duong-addons-run-test
2026-10-01 17:25:10 Using Dockerfile Tag odoo:Docker19
2026-10-01 17:25:18 INFO 1 modules loaded in 0.85s, 0 queries (+0 extra)
2026-10-01 17:25:31 INFO 301 modules loaded in 13.09s, 0 queries (+0 extra)
2026-10-01 17:25:33 INFO Pregenerating assets bundles
2026-10-01 17:47:33 ERROR FAILED: [1/19] Tour hr_skills_event_onsite_tour → Step Open Employees app (trigger: .o_app[data-menu-xmlid='hr.menu_hr_root']). Element (.o_app[data-menu-xmlid='hr.menu_hr_root']) has not been found. TIMEOUT step failed to complete within 10000 ms.
2026-10-01 17:47:33 INFO Error received after termination: ---------- FAILED: [1/19] Tour hr_skills_event_onsite_tour → Step Open Employees app (trigger: .o_app[data-menu-xmlid='hr.menu_hr_root']) ---------- { "content": "Open Employees app", "trigger": ".o_app[data-menu-xmlid='hr.menu_hr_root']", "run": "click" }, ---------------------------------------------------------------------------------------------------------------------------------------------------- { "content": "Go to test employee", "trigger": "span:contains('Test Employee')", "run": "click" }, { "content": "Go to Resume Tab", "trigger": "a.nav-link[name='resume']", "run": "click" }, { "content": "Open New Resume Line form", "trigger": "button:contains('Create Resume Lines')", "run": "click" },
2026-10-01 17:47:33 INFO Screenshot
2026-10-01 17:47:33 INFO Chrome Log
2026-10-01 17:47:33 ERROR FAIL: TestOnsite.test_onsite_employee_registration Traceback (most recent call last): File "/data/build/odoo/addons/hr_skills_event/tests/test_onsite.py", line 16, in test_onsite_employee_registration self.start_tour("/odoo", 'hr_skills_event_onsite_tour', login='admin') File "/data/build/odoo/odoo/tests/common.py", line 2597, in start_tour self.browser_js(url_path=url_path, code=code, ready=ready, timeout=timeout, success_signal="tour succeeded", **kwargs) File "/data/build/odoo/odoo/tests/common.py", line 2567, in browser_js self.fail('%s\n\n%s' % (message, error)) AssertionError: The test code "odoo.startTour('hr_skills_event_onsite_tour', {"stepDelay": 0, "keepWatchBrowser": false, "debug": false, "startUrl": "/odoo", "delayToCheckUndeterminisms": 0})" failed FAILED: [1/19] Tour hr_skills_event_onsite_tour → Step Open Employees app (trigger: .o_app[data-menu-xmlid='hr.menu_hr_root']). Element (.o_app[data-menu-xmlid='hr.menu_hr_root']) has not been found. TIMEOUT step failed to complete within 10000 ms.
2026-10-01 17:48:25 ERROR 1 failed, 0 error(s) of 378 tests when loading database '01294-19-0-all'
2026-10-01 17:48:49 INFO Getting results for build 01294-19-0
2026-10-01 17:48:49 Step test_post_install finished in 23m