Description: Post install tests for a -> !b
Commit: duong-addons:3e1cddfc  
Subject: [FIX] d_tiktok_shop_connector*: update tests for Odoo 19
Author: Claude
Commit: odoo:99edb6dd  
Subject: [IMP] account_edi_ubl_cii: Support section in UBL.
Author: Jugurtha
Build time: 77m
Wait time: 94m
Load time: 1h17m
Date (UTC) Level Message
2026-10-02 11:42:45 INFO Init build environment with config duong-addons-run-test
2026-10-02 11:42:45 Starting step restore from config duong-addons-run-test
2026-10-02 11:42:45 Restoring dump 01301-19-0-all.zip from build 1301
2026-10-02 11:42:45 Using Dockerfile Tag odoo:Docker19
2026-10-02 11:44:20 INFO Step restore finished in 92s
2026-10-02 11:44:20 Starting step test_post_install from config duong-addons-run-test
2026-10-02 11:44:20 Using Dockerfile Tag odoo:Docker19
2026-10-02 11:44:31 INFO 1 modules loaded in 1.24s, 0 queries (+0 extra)
2026-10-02 11:44:51 INFO 301 modules loaded in 18.98s, 0 queries (+0 extra)
2026-10-02 11:44:54 INFO Pregenerating assets bundles
2026-10-02 12:27:20 INFO Documents module is not installed, skipping part of the test
2026-10-02 12:38:34 ERROR ERROR: TestProduct.test_internal_user_can_read_product_with_tax_and_tags Traceback (most recent call last): File "/data/build/odoo/addons/account/tests/test_product.py", line 36, in test_internal_user_can_read_product_with_tax_and_tags with Form(self.product_a.with_user(self.internal_user)) as form_a: ^^^^^^^^^^^^^^^^^^^^^^^^^^^^^^^^^^^^^^^^^^^^^^^^^^ File "/data/build/odoo/odoo/tests/form.py", line 127, in __init__ view = self._process_view(tree, record) ^^^^^^^^^^^^^^^^^^^^^^^^^^^^^^^^ File "/data/build/odoo/odoo/tests/form.py", line 252, in _process_view edition_view = self._get_one2many_edition_view(field_info, node, level) ^^^^^^^^^^^^^^^^^^^^^^^^^^^^^^^^^^^^^^^^^^^^^^^^^^^^^^^^ File "/data/build/odoo/odoo/tests/form.py", line 297, in _get_one2many_edition_view subviews = submodel.with_context(**refs).get_views([(None, view_type)]) ^^^^^^^^^^^^^^^^^^^^^^^^^^^^^^^^^^^^^^^^^^^^^^^^^^^^^^^^^^^^ File "/data/build/odoo/odoo/addons/base/models/ir_ui_view.py", line 2934, in get_views v_type: self.get_view( ^^^^^^^^^^^^^^ File "/data/build/odoo/odoo/addons/base/models/ir_ui_view.py", line 3167, in get_view self.browse().check_access('read') File "/data/build/odoo/odoo/orm/models.py", line 4121, in check_access raise result[1]() odoo.exceptions.AccessError: You are not allowed to access 'TikTok Product Attribute Line' (d.tiktok.product.attribute.line) records. This operation is allowed for the following groups: - Sales/Administrator - Sales/User: Own Documents Only Contact your administrator to request access if necessary.
2026-10-02 12:44:12 ERROR ERROR: CiiExportFacturXFR.test_invoice_deferred_dates Traceback (most recent call last): File "/data/build/odoo/odoo/orm/models.py", line 6088, in _update_cache field_values = [(fields[name], value) for name, value in values.items() if name != 'id'] ~~~~~~^^^^^^ KeyError: 'deferred_start_date' During handling of the above exception, another exception occurred: Traceback (most recent call last): File "/data/build/odoo/addons/account_edi_ubl_cii/tests/test_cii_export_facturx_fr.py", line 433, in test_invoice_deferred_dates invoice = self._create_invoice( ^^^^^^^^^^^^^^^^^^^^^ File "/data/build/odoo/addons/account/tests/common.py", line 762, in _create_invoice invoice = cls.env['account.move'].create([{ ^^^^^^^^^^^^^^^^^^^^^^^^^^^^^^^^^ File "/data/build/odoo/odoo/orm/decorators.py", line 369, in create return method(self, vals_list) ^^^^^^^^^^^^^^^^^^^^^^^ File "/data/build/odoo/addons/account/models/account_move.py", line 3910, in create moves = super().create(vals_list) ^^^^^^^^^^^^^^^^^^^^^^^^^ File "/data/build/odoo/odoo/orm/decorators.py", line 369, in create return method(self, vals_list) ^^^^^^^^^^^^^^^^^^^^^^^ File "/data/build/odoo/addons/mail/models/mail_thread.py", line 325, in create threads = super(MailThread, self).create(vals_list) ^^^^^^^^^^^^^^^^^^^^^^^^^^^^^^^^^^^^^^^^^ File "/data/build/odoo/odoo/orm/decorators.py", line 369, in create return method(self, vals_list) ^^^^^^^^^^^^^^^^^^^^^^^ File "/data/build/odoo/odoo/orm/models.py", line 4663, in create new_vals_list = self._prepare_create_values(vals_list) ^^^^^^^^^^^^^^^^^^^^^^^^^^^^^^^^^^^^^^ File "/data/build/odoo/odoo/orm/models.py", line 4816, in _prepare_create_values self._add_precomputed_values(result_vals_list) File "/data/build/odoo/odoo/orm/models.py", line 4842, in _add_precomputed_values records = self.browse().concat(*(self.new(vals) for vals in vals_list_todo)) ^^^^^^^^^^^^^^^^^^^^^^^^^^^^^^^^^^^^^^^^^^^^^^^^^^^^^^^^^^^^^^^^^^ File "/data/build/odoo/odoo/orm/models.py", line 4842, in <genexpr> records = self.browse().concat(*(self.new(vals) for vals in vals_list_todo)) ^^^^^^^^^^^^^^ File "/data/build/odoo/odoo/orm/models.py", line 6471, in new record._update_cache(values, validate=False) File "/data/build/odoo/odoo/orm/models.py", line 6094, in _update_cache value = field.convert_to_cache(value, self, validate) ^^^^^^^^^^^^^^^^^^^^^^^^^^^^^^^^^^^^^^^^^^^^^ File "/data/build/odoo/odoo/orm/fields_relational.py", line 615, in convert_to_cache ids.add(comodel.new(command[2], ref=command[1]).id) ^^^^^^^^^^^^^^^^^^^^^^^^^^^^^^^^^^^^^^^ File "/data/build/odoo/odoo/orm/models.py", line 6471, in new record._update_cache(values, validate=False) File "/data/build/odoo/odoo/orm/models.py", line 6090, in _update_cache raise ValueError("Invalid field %r on model %r" % (e.args[0], self._name)) ValueError: Invalid field 'deferred_start_date' on model 'account.move.line'
2026-10-02 12:59:40 ERROR 0 failed, 2 error(s) of 1226 tests when loading database '01304-19-0-all'
2026-10-02 13:00:04 INFO Getting results for build 01304-19-0
2026-10-02 13:00:04 Step test_post_install finished in 75m
2026-10-02 14:24:28 INFO Killing build 01304-19-0, requested by OdooBot (user #1)
2026-10-02 14:24:28 INFO Killing build 01304-19-0, requested by OdooBot (user #1)