Description: Post install tests for m -> !s
Commit: duong-addons:a132f9f1  
Subject: [FIX] d_crm_meta_lead_ads tests: apply the Minimum ROAS goal before building the bid payload
Author: Claude
Commit: odoo:99edb6dd  
Subject: [IMP] account_edi_ubl_cii: Support section in UBL.
Author: Jugurtha
Build time: 72m
Wait time: 4h
Load time: 1h12m
Date (UTC) Level Message
2026-10-02 17:03:06 INFO Init build environment with config duong-addons-run-test
2026-10-02 17:03:06 Starting step restore from config duong-addons-run-test
2026-10-02 17:03:06 Restoring dump 01316-19-0-all.zip from build 1316
2026-10-02 17:03:06 Using Dockerfile Tag odoo:Docker19
2026-10-02 17:04:53 INFO Step restore finished in 102s
2026-10-02 17:04:53 Starting step test_post_install from config duong-addons-run-test
2026-10-02 17:04:53 Using Dockerfile Tag odoo:Docker19
2026-10-02 17:05:04 INFO 1 modules loaded in 1.14s, 0 queries (+0 extra)
2026-10-02 17:05:20 INFO 301 modules loaded in 15.63s, 0 queries (+0 extra)
2026-10-02 17:05:23 INFO Pregenerating assets bundles
2026-10-02 17:59:41 ERROR bad query: b'INSERT INTO "pos_order_line" ("create_date", "create_uid", "discount", "is_edited", "name", "order_id", "price_type", "price_unit", "product_id", "qty", "uuid", "write_date", "write_uid") VALUES (\'2026-10-02T17:59:24.431655\'::timestamp, 1, 0.0, false, \'000001\', 334, \'original\', 1.0, 1229, \'1.00\', \'1dac06a9-0915-4b70-a458-a1a210b5960d\', \'2026-10-02T17:59:24.431655\'::timestamp, 1) RETURNING "id"' ERROR: null value in column "price_subtotal" of relation "pos_order_line" violates not-null constraint DETAIL: Failing row contains (481, null, 1229, 334, null, null, null, 1, 1, 000001, null, original, null, null, 1dac06a9-0915-4b70-a458-a1a210b5960d, null, null, 1.0, 1.00, null, null, null, 0.0, null, f, 2026-10-02 17:59:24.431655, 2026-10-02 17:59:24.431655, null, null, null, null, null, null, null, null).
2026-10-02 17:59:41 ERROR ERROR: TestBinancePayPos.test_pos_goods_details_use_pos_order_lines Traceback (most recent call last): File "/data/build/duong-addons/pos_online_payment_qr_binancepay/tests/test_binance_pay_pos.py", line 253, in test_pos_goods_details_use_pos_order_lines line = self.env['pos.order.line'].create({ ^^^^^^^^^^^^^^^^^^^^^^^^^^^^^^^^^^^ File "/data/build/odoo/odoo/orm/decorators.py", line 369, in create return method(self, vals_list) ^^^^^^^^^^^^^^^^^^^^^^^ File "/data/build/odoo/addons/pos_self_order/models/pos_order.py", line 26, in create return super().create(vals_list) ^^^^^^^^^^^^^^^^^^^^^^^^^ File "/data/build/odoo/odoo/orm/decorators.py", line 369, in create return method(self, vals_list) ^^^^^^^^^^^^^^^^^^^^^^^ File "/data/build/odoo/addons/point_of_sale/models/pos_order.py", line 1732, in create return super().create(vals_list) ^^^^^^^^^^^^^^^^^^^^^^^^^ File "/data/build/odoo/odoo/orm/decorators.py", line 369, in create return method(self, vals_list) ^^^^^^^^^^^^^^^^^^^^^^^ File "/data/build/odoo/odoo/orm/models.py", line 4717, in create records = self._create(data_list) ^^^^^^^^^^^^^^^^^^^^^^^ File "/data/build/odoo/odoo/orm/models.py", line 4894, in _create cr.execute(SQL( File "/data/build/odoo/odoo/sql_db.py", line 440, in execute self._obj.execute(query, params) psycopg2.errors.NotNullViolation: null value in column "price_subtotal" of relation "pos_order_line" violates not-null constraint DETAIL: Failing row contains (481, null, 1229, 334, null, null, null, 1, 1, 000001, null, original, null, null, 1dac06a9-0915-4b70-a458-a1a210b5960d, null, null, 1.0, 1.00, null, null, null, 0.0, null, f, 2026-10-02 17:59:24.431655, 2026-10-02 17:59:24.431655, null, null, null, null, null, null, null, null).
2026-10-02 18:05:24 WARNING Failed to read field pos.payment.method.online_payment_provider_ids You are not allowed to access 'Payment Provider' (payment.provider) records. This operation is allowed for the following groups: - Point of Sale/Administrator - Role / Administrator Contact your administrator to request access if necessary.
2026-10-02 18:05:24 ERROR ERROR: TestSelfOrderController.test_generate_return_values_includes_payment_method Traceback (most recent call last): File "/data/build/odoo/addons/pos_self_order/tests/test_self_order_controller.py", line 258, in test_generate_return_values_includes_payment_method self.assertIn('pos.payment.method', data) File "/usr/lib/python3.12/unittest/case.py", line 1149, in assertIn if member not in container: ^^^^^^^^^^^^^^^^^^^^^^^ TypeError: argument of type 'NoneType' is not iterable
2026-10-02 18:05:31 WARNING Failed to read field pos.payment.method.online_payment_provider_ids You are not allowed to access 'Payment Provider' (payment.provider) records. This operation is allowed for the following groups: - Point of Sale/Administrator - Role / Administrator Contact your administrator to request access if necessary.
2026-10-02 18:05:31 ERROR ERROR: TestSelfOrderController.test_get_orders_by_access_token Traceback (most recent call last): File "/data/build/odoo/addons/pos_self_order/tests/test_self_order_controller.py", line 59, in test_get_orders_by_access_token self.assertEqual(len(data['pos.order']), 1) ~~~~^^^^^^^^^^^^^ TypeError: 'NoneType' object is not subscriptable
2026-10-02 18:14:53 ERROR 0 failed, 3 error(s) of 1362 tests when loading database '01326-19-0-all'
2026-10-02 18:15:23 INFO Getting results for build 01326-19-0
2026-10-02 18:15:23 Step test_post_install finished in 70m