Description: Post install tests for s ->
Commit: duong-addons:a132f9f1  
Subject: [FIX] d_crm_meta_lead_ads tests: apply the Minimum ROAS goal before building the bid payload
Author: Claude
Commit: odoo:99edb6dd  
Subject: [IMP] account_edi_ubl_cii: Support section in UBL.
Author: Jugurtha
Build time: 3h
Wait time: 5h
Load time: 2h43m
Date (UTC) Level Message
2026-10-02 17:06:51 INFO Init build environment with config duong-addons-run-test
2026-10-02 17:06:51 Starting step restore from config duong-addons-run-test
2026-10-02 17:06:51 Restoring dump 01316-19-0-all.zip from build 1316
2026-10-02 17:06:51 Using Dockerfile Tag odoo:Docker19
2026-10-02 17:08:32 INFO Step restore finished in 100s
2026-10-02 17:08:32 Starting step test_post_install from config duong-addons-run-test
2026-10-02 17:08:32 Using Dockerfile Tag odoo:Docker19
2026-10-02 17:08:41 INFO 1 modules loaded in 1.24s, 0 queries (+0 extra)
2026-10-02 17:09:09 INFO 301 modules loaded in 26.82s, 0 queries (+0 extra)
2026-10-02 17:09:12 INFO Pregenerating assets bundles
2026-10-02 18:04:09 INFO [HOOT] Passed 199 tests (976 assertions, total time: 00:00:06)
2026-10-02 18:04:15 INFO QUnit: passed 72 tests (213 assertions), took 1s
2026-10-02 19:04:23 INFO Screenshot
2026-10-02 19:04:24 INFO Chrome Log
2026-10-02 19:04:24 ERROR FAIL: WebSuite.test_unit_desktop Traceback (most recent call last): File "/data/build/odoo/addons/web/tests/test_js.py", line 191, in test_unit_desktop self.browser_js(f'/web/tests?headless&loglevel=2&preset=desktop&timeout=15000{self.hoot_filters}', "", "", login='admin', timeout=3600, success_signal="[HOOT] Test suite succeeded", error_checker=unit_test_error_checker) File "/data/build/odoo/odoo/tests/common.py", line 2567, in browser_js self.fail('%s\n\n%s' % (message, error)) AssertionError: Some js test failed Script timeout exceeded
2026-10-02 19:08:21 ERROR [HOOT] HootError: test "toggle filters in year view" timed out after 15000 milliseconds
2026-10-02 19:08:21 ERROR [HOOT] Test "@web/views/calendar/calendar_view/toggle filters in year view" failed: Failed assertion: 43. [errors] 1 unverified error(s) Error during test: test "toggle filters in year view" timed out after 15000 milliseconds
2026-10-02 19:33:41 INFO [HOOT] Failed 1 tests (9279 passed, total time: 00:29:04)
2026-10-02 19:33:41 ERROR Some tests failed: see above for details Failed tests link: http://127.0.0.1:8069/web/tests?preset=mobile&id=55528b80&debugTest=true&debug=assets
2026-10-02 19:33:41 INFO Screenshot
2026-10-02 19:33:41 INFO Chrome Log
2026-10-02 19:33:42 ERROR FAIL: MobileWebSuite.test_unit_mobile Traceback (most recent call last): File "/data/build/odoo/addons/web/tests/test_js.py", line 254, in test_unit_mobile self.browser_js(f'/web/tests?headless&loglevel=2&preset=mobile&tag=-headless&timeout=15000{self.hoot_filters}', "", "", login='admin', timeout=2100, success_signal="[HOOT] Test suite succeeded", error_checker=unit_test_error_checker) File "/data/build/odoo/odoo/tests/common.py", line 2567, in browser_js self.fail('%s\n\n%s' % (message, error)) AssertionError: Some js test failed Some tests failed: see above for details Failed tests link: http://127.0.0.1:8069/web/tests?preset=mobile&id=55528b80&debugTest=true&debug=assets
2026-10-02 19:34:39 INFO Error received after termination: TypeError: Failed to fetch at fetchTranslations (http://127.0.0.1:8069/web/assets/5b13b70/web.assets_web.min.js:2904:1835) at Object.start (http://127.0.0.1:8069/web/assets/5b13b70/web.assets_web.min.js:2906:672) at async Promise.all (index 9) at async start (http://127.0.0.1:8069/web/assets/5b13b70/web.assets_web.min.js:1462:1) at async _startServices (http://127.0.0.1:8069/web/assets/5b13b70/web.assets_web.min.js:1463:72) at async startServices (http://127.0.0.1:8069/web/assets/5b13b70/web.assets_web.min.js:1456:157) at async mountComponent (http://127.0.0.1:8069/web/assets/5b13b70/web.assets_web.min.js:1475:305) at async startWebClient (http://127.0.0.1:8069/web/assets/5b13b70/web.assets_web.min.js:27208:29)
2026-10-02 19:34:39 INFO Error received after termination: ConnectionLostError: Connection couldn't be established or was interrupted Error: Connection couldn't be established or was interrupted at http://127.0.0.1:8069/web/assets/5b13b70/web.assets_web.min.js:10898:709
2026-10-02 19:36:09 INFO public crawled 15 urls in 4.92s 397 queries, 0.328s 26.47q per request,
2026-10-02 19:36:37 INFO demo crawled 98 urls in 27.70s 3315 queries, 0.283s 33.83q per request
2026-10-02 19:43:40 ERROR FAIL: TestFuzzy.test_variant_default_code Traceback (most recent call last): File "/data/build/odoo/addons/website_sale/tests/test_fuzzy.py", line 75, in test_variant_default_code self.assertEqual(1, results_count, "Should have found red") AssertionError: 1 != 0 : Should have found red
2026-10-02 19:50:18 ERROR 3 failed, 0 error(s) of 1268 tests when loading database '01327-19-0-all'
2026-10-02 19:50:44 INFO Getting results for build 01327-19-0
2026-10-02 19:50:44 Step test_post_install finished in 3h