Description: Post install tests for s ->
Commit: duong-addons:daff8a50  
Subject: Merge branch '19.0' into 19.0-fix_runbot_20261001
Author: Nguyễn Đại Dương
Committer: GitHub
Commit: odoo:99edb6dd  
Subject: [IMP] account_edi_ubl_cii: Support section in UBL.
Author: Jugurtha
Build time: 79m
Wait time: 124m
Load time: 1h19m
Date (UTC) Level Message
2026-10-04 10:46:21 INFO Init build environment with config duong-addons-run-test
2026-10-04 10:46:21 Starting step restore from config duong-addons-run-test
2026-10-04 10:46:21 Restoring dump 01471-19-0-all.zip from build 1471
2026-10-04 10:46:21 Using Dockerfile Tag odoo:Docker19
2026-10-04 10:48:44 INFO Step restore finished in 2m
2026-10-04 10:48:44 Starting step test_post_install from config duong-addons-run-test
2026-10-04 10:48:44 Using Dockerfile Tag odoo:Docker19
2026-10-04 10:48:56 INFO 1 modules loaded in 1.50s, 0 queries (+0 extra)
2026-10-04 10:49:29 INFO 301 modules loaded in 32.10s, 0 queries (+0 extra)
2026-10-04 10:49:33 INFO Pregenerating assets bundles
2026-10-04 10:54:27 ERROR ERROR: TestSalesControllers.test_sales_portal_report Traceback (most recent call last): File "/usr/lib/python3/dist-packages/urllib3/connectionpool.py", line 537, in _make_request response = conn.getresponse() ^^^^^^^^^^^^^^^^^^ File "/usr/lib/python3/dist-packages/urllib3/connection.py", line 461, in getresponse httplib_response = super().getresponse() ^^^^^^^^^^^^^^^^^^^^^ File "/usr/lib/python3.12/http/client.py", line 1448, in getresponse response.begin() File "/usr/lib/python3.12/http/client.py", line 336, in begin version, status, reason = self._read_status() ^^^^^^^^^^^^^^^^^^^ File "/usr/lib/python3.12/http/client.py", line 297, in _read_status line = str(self.fp.readline(_MAXLINE + 1), "iso-8859-1") ^^^^^^^^^^^^^^^^^^^^^^^^^^^^^^ File "/usr/lib/python3.12/socket.py", line 707, in readinto return self._sock.recv_into(b) ^^^^^^^^^^^^^^^^^^^^^^^ TimeoutError: timed out The above exception was the direct cause of the following exception: Traceback (most recent call last): File "/usr/lib/python3/dist-packages/requests/adapters.py", line 486, in send resp = conn.urlopen( ^^^^^^^^^^^^^ File "/usr/lib/python3/dist-packages/urllib3/connectionpool.py", line 845, in urlopen retries = retries.increment( ^^^^^^^^^^^^^^^^^^ File "/usr/lib/python3/dist-packages/urllib3/util/retry.py", line 472, in increment raise reraise(type(error), error, _stacktrace) ^^^^^^^^^^^^^^^^^^^^^^^^^^^^^^^^^^^^^^^^ File "/usr/lib/python3/dist-packages/urllib3/util/util.py", line 39, in reraise raise value File "/usr/lib/python3/dist-packages/urllib3/connectionpool.py", line 791, in urlopen response = self._make_request( ^^^^^^^^^^^^^^^^^^^ File "/usr/lib/python3/dist-packages/urllib3/connectionpool.py", line 539, in _make_request self._raise_timeout(err=e, url=url, timeout_value=read_timeout) File "/usr/lib/python3/dist-packages/urllib3/connectionpool.py", line 371, in _raise_timeout raise ReadTimeoutError( urllib3.exceptions.ReadTimeoutError: HTTPConnectionPool(host='127.0.0.1', port=8069): Read timed out. (read timeout=12) During handling of the above exception, another exception occurred: Traceback (most recent call last): File "/data/build/odoo/addons/sale/tests/test_controllers.py", line 90, in test_sales_portal_report req = self.url_open(portal_so.get_portal_url(report_type='pdf'), allow_redirects=False) ^^^^^^^^^^^^^^^^^^^^^^^^^^^^^^^^^^^^^^^^^^^^^^^^^^^^^^^^^^^^^^^^^^^^^^^^^^^^^^^^^ File "/data/build/odoo/odoo/tests/common.py", line 2342, in url_open return self.opener.request(method, url, params=params, data=data, json=json, files=files, timeout=timeout, headers=headers, cookies=cookies, allow_redirects=allow_redirects) ^^^^^^^^^^^^^^^^^^^^^^^^^^^^^^^^^^^^^^^^^^^^^^^^^^^^^^^^^^^^^^^^^^^^^^^^^^^^^^^^^^^^^^^^^^^^^^^^^^^^^^^^^^^^^^^^^^^^^^^^^^^^^^^^^^^^^^^^^^^^^^^^^^^^^^^^^^^^^^^^^^^^^^ File "/data/build/odoo/odoo/tests/common.py", line 2187, in request return super().request(*args, **kwargs) ^^^^^^^^^^^^^^^^^^^^^^^^^^^^^^^^ File "/usr/lib/python3/dist-packages/requests/sessions.py", line 589, in request resp = self.send(prep, **send_kwargs) ^^^^^^^^^^^^^^^^^^^^^^^^^^^^^^ File "/data/build/odoo/odoo/tests/common.py", line 378, in <lambda> lambda s, r, **kwargs: cls._request_handler(s, r, **kwargs), ^^^^^^^^^^^^^^^^^^^^^^^^^^^^^^^^^^^^ File "/data/build/odoo/odoo/tests/common.py", line 346, in _request_handler return _super_send(s, r, **kw) ^^^^^^^^^^^^^^^^^^^^^^^ File "/usr/lib/python3/dist-packages/requests/sessions.py", line 703, in send r = adapter.send(request, **kwargs) ^^^^^^^^^^^^^^^^^^^^^^^^^^^^^^^ File "/usr/lib/python3/dist-packages/requests/adapters.py", line 532, in send raise ReadTimeout(e, request=request) requests.exceptions.ReadTimeout: HTTPConnectionPool(host='127.0.0.1', port=8069): Read timed out. (read timeout=12)
2026-10-04 11:39:15 WARNING Chrome headless failed to start: [67:90:1004/113904.109714:ERROR:dbus/bus.cc:408] Failed to connect to the bus: Failed to connect to socket /run/dbus/system_bus_socket: No such file or directory [67:90:1004/113905.180667:ERROR:dbus/bus.cc:408] Failed to connect to the bus: Could not parse server address: Unknown address type (examples of valid types are "tcp" and on UNIX "unix") [67:90:1004/113905.185945:ERROR:dbus/bus.cc:408] Failed to connect to the bus: Failed to connect to socket /run/dbus/system_bus_socket: No such file or directory [67:90:1004/113905.193489:ERROR:dbus/bus.cc:408] Failed to connect to the bus: Failed to connect to socket /run/dbus/system_bus_socket: No such file or directory [105:105:1004/113905.982456:WARNING:sandbox/policy/linux/sandbox_linux.cc:414] InitializeSandbox() called with multiple threads in process gpu-process.
2026-10-04 11:39:15 INFO Chrome Log
2026-10-04 11:48:30 INFO [HOOT] Passed 199 tests (976 assertions, total time: 00:00:07)
2026-10-04 11:48:36 INFO QUnit: passed 72 tests (213 assertions), took 1s
2026-10-04 11:50:31 INFO public crawled 15 urls in 4.23s 397 queries, 0.282s 26.47q per request,
2026-10-04 11:51:00 INFO demo crawled 98 urls in 28.41s 3315 queries, 0.290s 33.83q per request
2026-10-04 12:05:13 ERROR 0 failed, 1 error(s) of 1264 tests when loading database '01484-19-0-all'
2026-10-04 12:05:41 INFO Getting results for build 01484-19-0
2026-10-04 12:05:41 Step test_post_install finished in 76m