| Date (UTC) | Level | Message | |
|---|---|---|---|
| 2026-10-08 16:53:49 | INFO | Init build environment with config duong-addons-run-test | |
| 2026-10-08 16:53:49 | Starting step test_pylint from config duong-addons-run-test | ||
| 2026-10-08 16:53:49 | Using Dockerfile Tag odoo:Docker19 | ||
| 2026-10-08 16:54:37 | INFO | 1 modules loaded in 22.68s, 8456 queries (+8456 extra) | |
| 2026-10-08 16:55:33 | ERROR | FAIL: Subtest ManifestLinter.test_manifests (module='d_social_crm_livechat') Traceback (most recent call last): File "/data/build/odoo/odoo/addons/test_lint/tests/test_manifests.py", line 32, in test_manifests self._test_manifest_values(manifest) File "/data/build/odoo/odoo/addons/test_lint/tests/test_manifests.py", line 56, in _test_manifest_values self.assertNotEqual( AssertionError: False == False : Setting manifest key application to the default manifest value for module 'd_social_crm_livechat'. You can remove this key from the dict to reduce noise/inconsistencies between manifests specifications and ease understanding of manifest content. | |
| 2026-10-08 16:56:29 | INFO | pylint version: 3.0.3 | |
| 2026-10-08 17:02:26 | ERROR | FAIL: TestPyLint.test_pylint Traceback (most recent call last): File "/data/build/odoo/odoo/addons/test_lint/tests/test_pylint.py", line 109, in test_pylint self.fail(f"pylint test failed:\n\n{r.stdout}\n{r.stderr}".strip()) AssertionError: pylint test failed: <unknown>:736: SyntaxWarning: invalid escape sequence '\-' <unknown>:1219: SyntaxWarning: invalid escape sequence '\;' <unknown>:1219: SyntaxWarning: invalid escape sequence '\,' | |
| 2026-10-08 17:02:26 | INFO | A process was killed by the OOM killer in container | |
| 2026-10-08 17:02:33 | ERROR | Module test_lint: 2 failures, 0 errors of 24 tests | |
| 2026-10-08 17:02:46 | INFO | 17 modules loaded in 486.74s, 4878 queries (+4930 extra) | |
| 2026-10-08 17:02:47 | ERROR | At least one test failed when loading the modules. | |
| 2026-10-08 17:02:47 | ERROR | 2 failed, 0 error(s) of 24 tests when loading database '01948-19-0-all' | |
| 2026-10-08 17:02:53 | INFO | Getting results for build 01948-19-0 | |
| 2026-10-08 17:02:53 | Step test_pylint finished in 9m |