Description: Post install tests for b -> !c
Commit: duong-addons:b91528ea  
Subject: [FIX] d_social_crm, d_social_crm_livechat: lint manifest default and create the wizard with its required lead_name in tests
Author: Claude
Commit: odoo:99edb6dd  
Subject: [IMP] account_edi_ubl_cii: Support section in UBL.
Author: Jugurtha
Build time: 14m
Wait time: 14m
Load time: 13m46s
Date (UTC) Level Message
2026-10-09 01:19:41 INFO Init build environment with config duong-addons-run-test
2026-10-09 01:19:41 Starting step restore from config duong-addons-run-test
2026-10-09 01:19:41 Restoring template 01982-19-0-all.zip from build 1982
2026-10-09 01:19:41 Using Dockerfile Tag odoo:Docker19
2026-10-09 01:22:17 INFO Step restore finished in 2m
2026-10-09 01:22:17 Starting step test_post_install from config duong-addons-run-test
2026-10-09 01:22:17 Using Dockerfile Tag odoo:Docker19
2026-10-09 01:22:29 INFO 1 modules loaded in 1.47s, 0 queries (+0 extra)
2026-10-09 01:22:52 INFO 308 modules loaded in 22.69s, 0 queries (+0 extra)
2026-10-09 01:22:56 INFO Pregenerating assets bundles
2026-10-09 01:26:46 INFO Screencast frames
2026-10-09 01:27:10 INFO Screencast frames
2026-10-09 01:32:11 ERROR ERROR: BusWebTests.test_bundle_sends_bus Traceback (most recent call last): File "/usr/lib/python3/dist-packages/urllib3/connectionpool.py", line 537, in _make_request response = conn.getresponse() ^^^^^^^^^^^^^^^^^^ File "/usr/lib/python3/dist-packages/urllib3/connection.py", line 461, in getresponse httplib_response = super().getresponse() ^^^^^^^^^^^^^^^^^^^^^ File "/usr/lib/python3.12/http/client.py", line 1448, in getresponse response.begin() File "/usr/lib/python3.12/http/client.py", line 336, in begin version, status, reason = self._read_status() ^^^^^^^^^^^^^^^^^^^ File "/usr/lib/python3.12/http/client.py", line 297, in _read_status line = str(self.fp.readline(_MAXLINE + 1), "iso-8859-1") ^^^^^^^^^^^^^^^^^^^^^^^^^^^^^^ File "/usr/lib/python3.12/socket.py", line 707, in readinto return self._sock.recv_into(b) ^^^^^^^^^^^^^^^^^^^^^^^ TimeoutError: timed out The above exception was the direct cause of the following exception: Traceback (most recent call last): File "/usr/lib/python3/dist-packages/requests/adapters.py", line 486, in send resp = conn.urlopen( ^^^^^^^^^^^^^ File "/usr/lib/python3/dist-packages/urllib3/connectionpool.py", line 845, in urlopen retries = retries.increment( ^^^^^^^^^^^^^^^^^^ File "/usr/lib/python3/dist-packages/urllib3/util/retry.py", line 472, in increment raise reraise(type(error), error, _stacktrace) ^^^^^^^^^^^^^^^^^^^^^^^^^^^^^^^^^^^^^^^^ File "/usr/lib/python3/dist-packages/urllib3/util/util.py", line 39, in reraise raise value File "/usr/lib/python3/dist-packages/urllib3/connectionpool.py", line 791, in urlopen response = self._make_request( ^^^^^^^^^^^^^^^^^^^ File "/usr/lib/python3/dist-packages/urllib3/connectionpool.py", line 539, in _make_request self._raise_timeout(err=e, url=url, timeout_value=read_timeout) File "/usr/lib/python3/dist-packages/urllib3/connectionpool.py", line 371, in _raise_timeout raise ReadTimeoutError( urllib3.exceptions.ReadTimeoutError: HTTPConnectionPool(host='127.0.0.1', port=8069): Read timed out. (read timeout=12) During handling of the above exception, another exception occurred: Traceback (most recent call last): File "/data/build/odoo/addons/bus/tests/test_assetsbundle.py", line 28, in test_bundle_sends_bus self.assertEqual(self.url_open('/web/assets/any/web.assets_web.min.js', allow_redirects=False).status_code, 200) ^^^^^^^^^^^^^^^^^^^^^^^^^^^^^^^^^^^^^^^^^^^^^^^^^^^^^^^^^^^^^^^^^^^^^^^^^^^^^ File "/data/build/odoo/odoo/tests/common.py", line 2342, in url_open return self.opener.request(method, url, params=params, data=data, json=json, files=files, timeout=timeout, headers=headers, cookies=cookies, allow_redirects=allow_redirects) ^^^^^^^^^^^^^^^^^^^^^^^^^^^^^^^^^^^^^^^^^^^^^^^^^^^^^^^^^^^^^^^^^^^^^^^^^^^^^^^^^^^^^^^^^^^^^^^^^^^^^^^^^^^^^^^^^^^^^^^^^^^^^^^^^^^^^^^^^^^^^^^^^^^^^^^^^^^^^^^^^^^^^^ File "/data/build/odoo/odoo/tests/common.py", line 2187, in request return super().request(*args, **kwargs) ^^^^^^^^^^^^^^^^^^^^^^^^^^^^^^^^ File "/usr/lib/python3/dist-packages/requests/sessions.py", line 589, in request resp = self.send(prep, **send_kwargs) ^^^^^^^^^^^^^^^^^^^^^^^^^^^^^^ File "/data/build/odoo/odoo/tests/common.py", line 378, in <lambda> lambda s, r, **kwargs: cls._request_handler(s, r, **kwargs), ^^^^^^^^^^^^^^^^^^^^^^^^^^^^^^^^^^^^ File "/data/build/odoo/odoo/tests/common.py", line 346, in _request_handler return _super_send(s, r, **kw) ^^^^^^^^^^^^^^^^^^^^^^^ File "/usr/lib/python3/dist-packages/requests/sessions.py", line 703, in send r = adapter.send(request, **kwargs) ^^^^^^^^^^^^^^^^^^^^^^^^^^^^^^^ File "/usr/lib/python3/dist-packages/requests/adapters.py", line 532, in send raise ReadTimeout(e, request=request) requests.exceptions.ReadTimeout: HTTPConnectionPool(host='127.0.0.1', port=8069): Read timed out. (read timeout=12)
2026-10-09 01:32:59 ERROR 0 failed, 1 error(s) of 337 tests when loading database '01986-19-0-all'
2026-10-09 01:33:27 INFO Getting results for build 01986-19-0
2026-10-09 01:33:27 Step test_post_install finished in 11m