| Date (UTC) | Level | Message | |
|---|---|---|---|
| 2026-10-10 18:54:43 | INFO | Init build environment with config duong-addons-run-test | |
| 2026-10-10 18:54:43 | Starting step restore from config duong-addons-run-test | ||
| 2026-10-10 18:54:43 | Restoring template 02110-19-0-all.zip from build 2110 | ||
| 2026-10-10 18:54:43 | Using Dockerfile Tag odoo:Docker19 | ||
| 2026-10-10 18:56:27 | INFO | Step restore finished in 102s | |
| 2026-10-10 18:56:27 | Starting step test_post_install from config duong-addons-run-test | ||
| 2026-10-10 18:56:27 | Using Dockerfile Tag odoo:Docker19 | ||
| 2026-10-10 18:56:38 | INFO | 1 modules loaded in 1.13s, 0 queries (+0 extra) | |
| 2026-10-10 18:57:06 | INFO | 308 modules loaded in 27.63s, 0 queries (+0 extra) | |
| 2026-10-10 18:57:09 | INFO | Pregenerating assets bundles | |
| 2026-10-10 19:17:17 | WARNING | Chrome headless failed to start: [6583:6605:1010/191713.454866:ERROR:dbus/bus.cc:408] Failed to connect to the bus: Failed to connect to socket /run/dbus/system_bus_socket: No such file or directory [6583:6605:1010/191714.166536:ERROR:dbus/bus.cc:408] Failed to connect to the bus: Could not parse server address: Unknown address type (examples of valid types are "tcp" and on UNIX "unix") [6583:6605:1010/191714.176960:ERROR:dbus/bus.cc:408] Failed to connect to the bus: Failed to connect to socket /run/dbus/system_bus_socket: No such file or directory [6583:6605:1010/191714.197613:ERROR:dbus/bus.cc:408] Failed to connect to the bus: Failed to connect to socket /run/dbus/system_bus_socket: No such file or directory [6618:6618:1010/191715.696231:WARNING:sandbox/policy/linux/sandbox_linux.cc:414] InitializeSandbox() called with multiple threads in process gpu-process. [6583:6583:1010/191715.757976:INFO:components/enterprise/browser/controller/chrome_browser_cloud_management_controller.cc:206] No machine level policy manager exists. [6583:6605:1010/191716.069747:ERROR:dbus/bus.cc:408] Failed to connect to the bus: Could not parse server address: Unknown address type (examples of valid types are "tcp" and on UNIX "unix") [6583:6605:1010/191716.878589:ERROR:dbus/bus.cc:408] Failed to connect to the bus: Could not parse server address: Unknown address type (examples of valid types are "tcp" and on UNIX "unix") [6583:6583:1010/191717.868093:ERROR:dbus/object_proxy.cc:573] Failed to call method: org.freedesktop.DBus.NameHasOwner: object_path= /org/freedesktop/DBus: unknown error type: [6583:6583:1010/191717.869958:WARNING:device/bluetooth/dbus/bluez_dbus_manager.cc:209] Floss manager service not available, cannot set Floss enable/disable. [6583:6605:1010/191717.870590:ERROR:dbus/bus.cc:408] Failed to connect to the bus: Could not parse server address: Unknown address type (examples of valid types are "tcp" and on UNIX "unix") [6583:6605:1010/191717.870684:ERROR:dbus/bus.cc:408] Failed to connect to the bus: Could not parse server address: Unknown address type (examples of valid types are "tcp" and on UNIX "unix") [6583:6605:1010/191717.870736:ERROR:dbus/bus.cc:408] Failed to connect to the bus: Could not parse server address: Unknown address type (examples of valid types are "tcp" and on UNIX "unix") [6583:6605:1010/191717.870765:ERROR:dbus/bus.cc:408] Failed to connect to the bus: Could not parse server address: Unknown address type (examples of valid types are "tcp" and on UNIX "unix") [6583:6605:1010/191717.870776:ERROR:dbus/bus.cc:408] Failed to connect to the bus: Could not parse server address: Unknown address type (examples of valid types are "tcp" and on UNIX "unix") [6583:6605:1010/191717.870787:ERROR:dbus/bus.cc:408] Failed to connect to the bus: Could not parse server address: Unknown address type (examples of valid types are "tcp" and on UNIX "unix") | |
| 2026-10-10 19:17:18 | INFO | Chrome Log | |
| 2026-10-10 19:52:59 | WARNING | You can only cancel a session that is in opening control state and has no orders. | |
| 2026-10-10 20:16:56 | WARNING | You can only cancel a session that is in opening control state and has no orders. | |
| 2026-10-10 20:18:28 | WARNING | You can only cancel a session that is in opening control state and has no orders. | |
| 2026-10-10 20:57:56 | ERROR | ERROR: setUpClass (odoo.addons.pos_online_payment_qr_binancepay.tests.test_frontend.TestBinancePayPosFrontend) Traceback (most recent call last): File "/data/build/duong-addons/pos_online_payment_qr_binancepay/tests/test_frontend.py", line 18, in setUpClass cls.provider.write({ File "/data/build/odoo/addons/payment_adyen/models/payment_provider.py", line 65, in write return super().write(vals) ^^^^^^^^^^^^^^^^^^^ File "/data/build/odoo/addons/payment/models/payment_provider.py", line 349, in write state_changed_providers = self.filtered( ^^^^^^^^^^^^^^ File "/data/build/odoo/odoo/orm/models.py", line 6228, in filtered return self.browse(rec_id for rec_id, rec in zip(self._ids, self) if func(rec)) ^^^^^^^^^^^^^^^^^^^^^^^^^^^^^^^^^^^^^^^^^^^^^^^^^^^^^^^^^^^^^^^^^^^^^^^^ File "/data/build/odoo/odoo/orm/models.py", line 5910, in browse ids = tuple(ids) ^^^^^^^^^^ File "/data/build/odoo/odoo/orm/models.py", line 6228, in <genexpr> return self.browse(rec_id for rec_id, rec in zip(self._ids, self) if func(rec)) ^^^^^^^^^ File "/data/build/odoo/addons/payment/models/payment_provider.py", line 350, in <lambda> lambda p: p.state not in ('disabled', vals['state']) ^^^^^^^ File "/data/build/odoo/odoo/orm/fields.py", line 1701, in __get__ recs._fetch_field(self) File "/data/build/odoo/odoo/orm/models.py", line 3778, in _fetch_field self.fetch(fnames) File "/data/build/odoo/odoo/orm/models.py", line 3824, in fetch raise self.env['ir.rule']._make_access_error('read', forbidden) odoo.exceptions.AccessError: Uh-oh! Looks like you have stumbled upon some top-secret records. Sorry, Because I am accountman! (id=566) doesn't have 'read' access to: - Payment Provider (payment.provider) If you really, really need access, perhaps you can win over your friendly administrator with a batch of freshly baked cookies. This seems to be a multi-company issue, but you do not have access to the proper company to access the record anyhow. | |
| 2026-10-10 21:11:58 | ERROR | ERROR: TestFrontend.test_delete_line_release_table Traceback (most recent call last): File "/data/build/odoo/addons/pos_restaurant/tests/test_frontend.py", line 917, in test_delete_line_release_table order = self.pos_config.current_session_id.order_ids[1] ~~~~~~~~~~~~~~~~~~~~~~~~~~~~~~~~~~~~~~~~~~~~^^^ File "/data/build/odoo/odoo/orm/models.py", line 6705, in __getitem__ return self.browse((self._ids[key],)) ~~~~~~~~~^^^^^ IndexError: tuple index out of range | |
| 2026-10-10 21:56:27 | ERROR | FAILED: [7/7] Tour portal_project_sharing_chatter_mention_users → Step .o-mail-Composer-suggestion:contains('Georges'). Element (.o-mail-Composer-suggestion:contains('Georges')) has not been found. TIMEOUT step failed to complete within 10000 ms. | |
| 2026-10-10 21:56:28 | INFO | Error received after termination: { "trigger": ".o-mail-Composer-input", "run": "edit @xxx" }, { "trigger": "body:not(:has(.o-mail-Composer-suggestion))", "run": "[function]" }, { "trigger": ".o-mail-Composer-input", "run": "edit @Georges" }, ---------- FAILED: [7/7] Tour portal_project_sharing_chatter_mention_users → Step .o-mail-Composer-suggestion:contains('Georges') ---------- { "trigger": ".o-mail-Composer-suggestion:contains('Georges')" }, -------------------------------------------------------------------------------------------------------------------------------------------- | |
| 2026-10-10 21:56:28 | INFO | Screenshot | |
| 2026-10-10 21:56:28 | INFO | Chrome Log | |
| 2026-10-10 21:56:28 | ERROR | FAIL: TestProjectSharingUi.test_05_project_sharing_chatter_mention_users Traceback (most recent call last): File "/data/build/odoo/addons/project/tests/test_project_sharing_ui.py", line 188, in test_05_project_sharing_chatter_mention_users self.start_tour("/my/projects", "portal_project_sharing_chatter_mention_users", login="georges1") File "/data/build/odoo/odoo/tests/common.py", line 2597, in start_tour self.browser_js(url_path=url_path, code=code, ready=ready, timeout=timeout, success_signal="tour succeeded", **kwargs) File "/data/build/odoo/odoo/tests/common.py", line 2567, in browser_js self.fail('%s\n\n%s' % (message, error)) AssertionError: The test code "odoo.startTour('portal_project_sharing_chatter_mention_users', {"stepDelay": 0, "keepWatchBrowser": false, "debug": false, "startUrl": "/my/projects", "delayToCheckUndeterminisms": 0})" failed FAILED: [7/7] Tour portal_project_sharing_chatter_mention_users → Step .o-mail-Composer-suggestion:contains('Georges'). Element (.o-mail-Composer-suggestion:contains('Georges')) has not been found. TIMEOUT step failed to complete within 10000 ms. | |
| 2026-10-10 21:57:39 | ERROR | FAILED: [11/15] Tour project_templates_tour → Step Lets Create a second project from the template (trigger: .dropdown-menu button.dropdown-item:contains("Project Template")). Element (.dropdown-menu button.dropdown-item:contains("Project Template")) has not been found. TIMEOUT step failed to complete within 10000 ms. | |
| 2026-10-10 21:57:39 | INFO | Error received after termination: { "content": "Check for created project", "trigger": ".o_kanban_record:contains('New Project')" }, { "content": "Go to list view", "trigger": "button.o_switch_view.o_list", "run": "click" }, { "content": "Click on New Button of List view", "trigger": ".o_list_button_add", "run": "click" }, ---------- FAILED: [11/15] Tour project_templates_tour → Step Lets Create a second project from the template (trigger: .dropdown-menu button.dropdown-item:contains("Project Template")) ---------- { "content": "Lets Create a second project from the template", "trigger": ".dropdown-menu button.dropdown-item:contains(\"Project Template\")", "run": "click" }, --------------------------------------------------------------------------------------------------------------------------------------------------------------------------------------------------- { "trigger": ".modal div[name=\"name\"] .o_input", "run": "edit New Project 2" }, { "trigger": "button[name=\"create_project_from_template\"]", "run": "click" }, { "content": "Go back to list view", "trigger": ".breadcrumb-item a:contains('Projects')", "run": "click" }, | |
| 2026-10-10 21:57:39 | INFO | Screenshot | |
| 2026-10-10 21:57:39 | INFO | Chrome Log | |
| 2026-10-10 21:57:39 | ERROR | FAIL: TestProjectTemplatesTour.test_project_templates_tour Traceback (most recent call last): File "/data/build/odoo/addons/project/tests/test_project_template_ui.py", line 23, in test_project_templates_tour self.start_tour("/odoo", "project_templates_tour", login="admin") File "/data/build/odoo/odoo/tests/common.py", line 2597, in start_tour self.browser_js(url_path=url_path, code=code, ready=ready, timeout=timeout, success_signal="tour succeeded", **kwargs) File "/data/build/odoo/odoo/tests/common.py", line 2567, in browser_js self.fail('%s\n\n%s' % (message, error)) AssertionError: The test code "odoo.startTour('project_templates_tour', {"stepDelay": 0, "keepWatchBrowser": false, "debug": false, "startUrl": "/odoo", "delayToCheckUndeterminisms": 0})" failed FAILED: [11/15] Tour project_templates_tour → Step Lets Create a second project from the template (trigger: .dropdown-menu button.dropdown-item:contains("Project Template")). Element (.dropdown-menu button.dropdown-item:contains("Project Template")) has not been found. TIMEOUT step failed to complete within 10000 ms. | |
| 2026-10-10 21:58:49 | ERROR | FAILED: [19/29] Tour project_task_last_history_steps_tour → Step div.note-editable[spellcheck='true'].odoo-editor-editable. Element (div.note-editable[spellcheck='true'].odoo-editor-editable) has not been found. TIMEOUT step failed to complete within 10000 ms. | |
| 2026-10-10 21:58:49 | INFO | Error received after termination: { "trigger": ".modal button.btn-primary:enabled", "run": "click" }, { "trigger": ".modal button.btn-primary:text(Restore)", "run": "click" }, { "trigger": "div.note-editable.odoo-editor-editable", "run": "click" }, ---------- FAILED: [19/29] Tour project_task_last_history_steps_tour → Step div.note-editable[spellcheck='true'].odoo-editor-editable ---------- { "trigger": "div.note-editable[spellcheck='true'].odoo-editor-editable", "run": "[function]" }, ------------------------------------------------------------------------------------------------------------------------------------------------ { "isActive": [ "auto" ], "content": "save form", "trigger": ".o_form_button_save:enabled", "run": "click" }, { "content": "wait for save completion", "trigger": ".o_form_readonly, .o_form_saved" }, { "trigger": "div.note-editable.odoo-editor-editable", "run": "click" }, | |
| 2026-10-10 21:58:50 | INFO | Screenshot | |
| 2026-10-10 21:58:50 | INFO | Chrome Log | |
| 2026-10-10 21:58:50 | ERROR | FAIL: TestUi.test_project_task_last_history_steps Traceback (most recent call last): File "/data/build/odoo/addons/project/tests/test_project_ui.py", line 50, in test_project_task_last_history_steps self.start_tour('/odoo', 'project_task_last_history_steps_tour', login='admin') File "/data/build/odoo/odoo/tests/common.py", line 2597, in start_tour self.browser_js(url_path=url_path, code=code, ready=ready, timeout=timeout, success_signal="tour succeeded", **kwargs) File "/data/build/odoo/odoo/tests/common.py", line 2567, in browser_js self.fail('%s\n\n%s' % (message, error)) AssertionError: The test code "odoo.startTour('project_task_last_history_steps_tour', {"stepDelay": 0, "keepWatchBrowser": false, "debug": false, "startUrl": "/odoo", "delayToCheckUndeterminisms": 0})" failed FAILED: [19/29] Tour project_task_last_history_steps_tour → Step div.note-editable[spellcheck='true'].odoo-editor-editable. Element (div.note-editable[spellcheck='true'].odoo-editor-editable) has not been found. TIMEOUT step failed to complete within 10000 ms. | |
| 2026-10-10 22:05:43 | ERROR | 3 failed, 2 error(s) of 1915 tests when loading database '02120-19-0-all' | |
| 2026-10-10 22:06:09 | INFO | Getting results for build 02120-19-0 | |
| 2026-10-10 22:06:09 | Step test_post_install finished in 3h |